{"text_format":"1","workbook":"xlsx","n_sheets":3,"sheets":["Calculation","Module2","Module1"],"not_rendered":{"charts":6,"images":1,"macros":1,"external_links":2,"defined_names":73,"comments":1,"pivot_tables":0},"unopened":[{"sheet":"Module2","index":1,"reason":"part_missing"},{"sheet":"Module1","index":2,"reason":"part_missing"}],"bounds":{"document_bytes":16777216,"sheet_cells":100000,"rows_first":2000,"rows_last":500,"rows_between":2000,"halvings":0,"cell_chars":16384,"cell_head_chars":4096},"cells_cut":0,"cells_raw":0,"read":"whole","date_system":"1900"}

{"sheet":"Calculation","index":0,"n_rows":536,"n_cols":39,"rows_kept":536,"cut":false,"hidden":false,"merged":[[481,1,482,2],[5,5,5,10]]}
[]
[null,"Barton Consultancy"]
[]
["Client name",null,null,null,"Instructions"]
[null,null,null,null,1,"Input valuation date."]
["Long service leave data",null,null,null,2,"Count records to be included in this spreadsheet remembering to include former employees for the last three years.",null,null,null,null,null,null,null,null,null,null,null,null,null,null,null,"This version created 15 Dec 2015"]
[null,null,null,null,3,"Make room for required number of records by clicking button to the right"]
[null,null,null,null,4,"Read comments describing input data."]
["Valuation date",null,"2016-12-31",null,5,"Populate input data",null,null,null,null,null,null,null,null,null,null,null,null,null,null,null,"Changes made in this version"]
["Last year",null,{"$f":"EOMONTH(ValDate,-12)","v":"2015-12-31"},null,6,"Check totals, maximum and minimum for reasonableness.  ",null,null,null,null,null,null,null,null,null,null,null,null,null,null,null,"Allow for background leave utilisation"]
[null,null,null,null,7,"Correct if necessary, guided by minimum and maximum rows .",null,null,null,null,null,null,null,null,null,null,null,null,null,null,null,"Allow for specification of previous and next anniversary "]
[null,null,null,null,8,"Check and print Data summary",null,null,null,null,null,null,null,null,null,null,null,null,null,null,null,"Allow for current LS leave to be split into next year and subsequent"]
[null,null,null,null,9,"Send to Barton@Actuary.com.au"]
[]
["Data summary "]
[]
[null,null,"All","Minimum","Maximum","Average",null,"Year end",{"$f":"EOMONTH(ValDate,-48)","v":"2012-12-31"},{"$f":"EOMONTH(ValDate,-36)","v":"2013-12-31"},{"$f":"EOMONTH(ValDate,-24)","v":"2014-12-31"},{"$f":"EOMONTH(ValDate,-12)","v":"2015-12-31"},{"$f":"ValDate","v":"2016-12-31"},"All","Crude"]
["Records",null,{"$f":"B474","v":358},null,null,null,null,"Begin",{"$f":"SUM(IF($E$116:$E$473<=EOMONTH(I$17,-12),1,0)*IF($F$116:$F$473=0,1,0)) + SUM(IF($E$116:$E$473<=EOMONTH(I$17,-12),1,0)*IF($F$116:$F$473>EOMONTH(I$17,-12),1,0))","v":211},{"$f":"SUM(IF($E$116:$E$473<=EOMONTH(J$17,-12),1,0)*IF($F$116:$F$473=0,1,0)) + SUM(IF($E$116:$E$473<=EOMONTH(J$17,-12),1,0)*IF($F$116:$F$473>EOMONTH(J$17,-12),1,0))","v":243},{"$f":"SUM(IF($E$116:$E$473<=EOMONTH(K$17,-12),1,0)*IF($F$116:$F$473=0,1,0)) + SUM(IF($E$116:$E$473<=EOMONTH(K$17,-12),1,0)*IF($F$116:$F$473>EOMONTH(K$17,-12),1,0))","v":263},{"$f":"SUM(IF($E$116:$E$473<=EOMONTH(L$17,-12),1,0)*IF($F$116:$F$473=0,1,0)) + SUM(IF($E$116:$E$473<=EOMONTH(L$17,-12),1,0)*IF($F$116:$F$473>EOMONTH(L$17,-12),1,0))","v":297},{"$f":"SUM(IF($E$116:$E$473<=EOMONTH(M$17,-12),1,0)*IF($F$116:$F$473=0,1,0)) + SUM(IF($E$116:$E$473<=EOMONTH(M$17,-12),1,0)*IF($F$116:$F$473>EOMONTH(M$17,-12),1,0))","v":328},{"$f":"I18","v":211}]
[{"$f":"\"VALUATION DATE \" & UPPER(TEXT(ValDate,\"MMM YYYY\"))  & \" CURRENT EMPLOYEES\"","v":"VALUATION DATE DEC 2016 CURRENT EMPLOYEES"},null,null,null,null,null,null,"New",{"$f":"SUM(IF($E$116:$E$473>EOMONTH(I$17,-12),1,0)*IF($E$116:$E$473<=I$17,1,0))","v":32},{"$f":"SUM(IF($E$116:$E$473>EOMONTH(J$17,-12),1,0)*IF($E$116:$E$473<=J$17,1,0))","v":20},{"$f":"SUM(IF($E$116:$E$473>EOMONTH(K$17,-12),1,0)*IF($E$116:$E$473<=K$17,1,0))","v":34},{"$f":"SUM(IF($E$116:$E$473>EOMONTH(L$17,-12),1,0)*IF($E$116:$E$473<=L$17,1,0))","v":31},{"$f":"SUM(IF($E$116:$E$473>EOMONTH(M$17,-12),1,0)*IF($E$116:$E$473<=M$17,1,0))","v":30},{"$f":"SUM(I19:M19)","v":147}]
["Number and Age",null,{"$f":"INDEX(LiveAllRow,$T20)","v":71},null,null,{"$f":"AG$482","v":50.637128325508591},null,"Death",{"$f":"SUM(IF($F$116:$F$473>EOMONTH(I$17,-12),1,0)*IF($F$116:$F$473<=I$17,1,0)* IF($G$116:$G$473=$V20,1,0))","v":0},{"$f":"SUM(IF($F$116:$F$473>EOMONTH(J$17,-12),1,0)*IF($F$116:$F$473<=J$17,1,0)* IF($G$116:$G$473=$V20,1,0))","v":0},{"$f":"SUM(IF($F$116:$F$473>EOMONTH(K$17,-12),1,0)*IF($F$116:$F$473<=K$17,1,0)* IF($G$116:$G$473=$V20,1,0))","v":0},{"$f":"SUM(IF($F$116:$F$473>EOMONTH(L$17,-12),1,0)*IF($F$116:$F$473<=L$17,1,0)* IF($G$116:$G$473=$V20,1,0))","v":0},{"$f":"SUM(IF($F$116:$F$473>EOMONTH(M$17,-12),1,0)*IF($F$116:$F$473<=M$17,1,0)* IF($G$116:$G$473=$V20,1,0))","v":0},0,{"$f":"N20/(N$26+N20/2)","v":0},null,null,null,null,{"$f":"COLUMN(AG115)","v":33},null,1]
["Masculinity",null,null,null,null,{"$f":"AG$483","v":0.47887323943661969},null,"Incapacity",{"$f":"SUM(IF($F$116:$F$473>EOMONTH(I$17,-12),1,0)*IF($F$116:$F$473<=I$17,1,0)* IF($G$116:$G$473=$V21,1,0))","v":0},{"$f":"SUM(IF($F$116:$F$473>EOMONTH(J$17,-12),1,0)*IF($F$116:$F$473<=J$17,1,0)* IF($G$116:$G$473=$V21,1,0))","v":0},{"$f":"SUM(IF($F$116:$F$473>EOMONTH(K$17,-12),1,0)*IF($F$116:$F$473<=K$17,1,0)* IF($G$116:$G$473=$V21,1,0))","v":0},{"$f":"SUM(IF($F$116:$F$473>EOMONTH(L$17,-12),1,0)*IF($F$116:$F$473<=L$17,1,0)* IF($G$116:$G$473=$V21,1,0))","v":0},{"$f":"SUM(IF($F$116:$F$473>EOMONTH(M$17,-12),1,0)*IF($F$116:$F$473<=M$17,1,0)* IF($G$116:$G$473=$V21,1,0))","v":0},0,{"$f":"N21/(N$26+N21/2)","v":0},null,null,null,null,null,null,2]
[{"$f":"INDEX(HeaderRow,$T22)","v":"Initial qualifying"},null,{"$f":"INDEX(LiveAllRow,$T22)","v":497},{"$f":"INDEX(LiveMinRow,$T22)","v":7},{"$f":"INDEX(LiveMaxRow,$T22)","v":7},{"$f":"INDEX(LiveAvRow,$T22)","v":7},null,"Retire",{"$f":"SUM(IF($F$116:$F$473>EOMONTH(I$17,-12),1,0)*IF($F$116:$F$473<=I$17,1,0)* IF($G$116:$G$473=$V22,1,0))","v":0},{"$f":"SUM(IF($F$116:$F$473>EOMONTH(J$17,-12),1,0)*IF($F$116:$F$473<=J$17,1,0)* IF($G$116:$G$473=$V22,1,0))","v":0},{"$f":"SUM(IF($F$116:$F$473>EOMONTH(K$17,-12),1,0)*IF($F$116:$F$473<=K$17,1,0)* IF($G$116:$G$473=$V22,1,0))","v":0},{"$f":"SUM(IF($F$116:$F$473>EOMONTH(L$17,-12),1,0)*IF($F$116:$F$473<=L$17,1,0)* IF($G$116:$G$473=$V22,1,0))","v":0},{"$f":"SUM(IF($F$116:$F$473>EOMONTH(M$17,-12),1,0)*IF($F$116:$F$473<=M$17,1,0)* IF($G$116:$G$473=$V22,1,0))","v":0},0,{"$f":"N22/(N$26+N22/2)","v":0},null,null,null,null,{"$f":"COLUMN(H$474)","v":8},null,3]
["Subsequent qualifying",null,497,7,7,7,null,"Retrench ",{"$f":"SUM(IF($F$116:$F$473>EOMONTH(I$17,-12),1,0)*IF($F$116:$F$473<=I$17,1,0)* IF($G$116:$G$473=$V23,1,0))","v":0},{"$f":"SUM(IF($F$116:$F$473>EOMONTH(J$17,-12),1,0)*IF($F$116:$F$473<=J$17,1,0)* IF($G$116:$G$473=$V23,1,0))","v":0},{"$f":"SUM(IF($F$116:$F$473>EOMONTH(K$17,-12),1,0)*IF($F$116:$F$473<=K$17,1,0)* IF($G$116:$G$473=$V23,1,0))","v":0},{"$f":"SUM(IF($F$116:$F$473>EOMONTH(L$17,-12),1,0)*IF($F$116:$F$473<=L$17,1,0)* IF($G$116:$G$473=$V23,1,0))","v":0},{"$f":"SUM(IF($F$116:$F$473>EOMONTH(M$17,-12),1,0)*IF($F$116:$F$473<=M$17,1,0)* IF($G$116:$G$473=$V23,1,0))","v":0},0,{"$f":"N23/(N$26+N23/2)","v":0},null,null,null,null,{"$f":"COLUMN(I$474)","v":9},null,4]
["Initial rate",null,17.75,0.25,0.25,0.25,null,"Other ",{"$f":"SUM(IF($F$116:$F$473>EOMONTH(I$17,-12),1,0)*IF($F$116:$F$473<=I$17,1,0)* IF($G$116:$G$473=$V24,1,0))","v":0},{"$f":"SUM(IF($F$116:$F$473>EOMONTH(J$17,-12),1,0)*IF($F$116:$F$473<=J$17,1,0)* IF($G$116:$G$473=$V24,1,0))","v":0},{"$f":"SUM(IF($F$116:$F$473>EOMONTH(K$17,-12),1,0)*IF($F$116:$F$473<=K$17,1,0)* IF($G$116:$G$473=$V24,1,0))","v":0},{"$f":"SUM(IF($F$116:$F$473>EOMONTH(L$17,-12),1,0)*IF($F$116:$F$473<=L$17,1,0)* IF($G$116:$G$473=$V24,1,0))","v":0},{"$f":"SUM(IF($F$116:$F$473>EOMONTH(M$17,-12),1,0)*IF($F$116:$F$473<=M$17,1,0)* IF($G$116:$G$473=$V24,1,0))","v":0},0,{"$f":"N24/(N$26+N24/2)","v":0},null,null,null,null,{"$f":"COLUMN(J$474)","v":10},null,5]
["Subsequent rate",null,17.75,0.25,0.25,0.25,null,"End",{"$f":"SUM(IF($E$116:$E$473<=I$17,1,0)*IF($F$116:$F$473=0,1,0)) + SUM(IF($E$116:$E$473<=I$17,1,0)*IF($F$116:$F$473>I$17,1,0))","v":243},{"$f":"SUM(IF($E$116:$E$473<=J$17,1,0)*IF($F$116:$F$473=0,1,0)) + SUM(IF($E$116:$E$473<=J$17,1,0)*IF($F$116:$F$473>J$17,1,0))","v":263},{"$f":"SUM(IF($E$116:$E$473<=K$17,1,0)*IF($F$116:$F$473=0,1,0)) + SUM(IF($E$116:$E$473<=K$17,1,0)*IF($F$116:$F$473>K$17,1,0))","v":297},{"$f":"SUM(IF($E$116:$E$473<=L$17,1,0)*IF($F$116:$F$473=0,1,0)) + SUM(IF($E$116:$E$473<=L$17,1,0)*IF($F$116:$F$473>L$17,1,0))","v":328},{"$f":"SUM(IF($E$116:$E$473<=M$17,1,0)*IF($F$116:$F$473=0,1,0)) + SUM(IF($E$116:$E$473<=M$17,1,0)*IF($F$116:$F$473>M$17,1,0))","v":358},{"$f":"M25","v":358},null,null,null,null,null,{"$f":"COLUMN(K$474)","v":11}]
["Salary (Full time)",null,6268555.9299999997,0,142609,88289.520140845067,null,"Central",{"$f":"(I25+I18)/2","v":227},{"$f":"(J25+J18)/2","v":253},{"$f":"(K25+K18)/2","v":280},{"$f":"(L25+L18)/2","v":312.5},{"$f":"(M25+M18)/2","v":343},1415.5,null,null,null,null,null,{"$f":"COLUMN(L$474)","v":12}]
["Full time proportion accrued",null,62.913799999999995,0,1,0.88610985915492946,null,null,null,null,null,null,null,null,null,null,null,null,null,{"$f":"COLUMN(M$474)","v":13}]
["Full time proportion accruing",null,62.913799999999995,0,1,0.88610985915492946,null,null,{"$f":"IF(I18+I19-SUM(I20:I24) = I25,\"ok\",\"Problem\")","v":"ok"},"ok","ok","ok","ok","ok",null,null,null,null,null,{"$f":"COLUMN(N$474)","v":14}]
[{"$f":"Q114","v":"Entitlement years before FTE adjustment"}]
[{"$f":"INDEX(HeaderRow,$T30)","v":"Preconditional"},null,{"$f":"INDEX(LiveAllRow,$T30)","v":4.7145622655190031},{"$f":"INDEX(LiveMinRow,$T30)","v":0},{"$f":"INDEX(LiveMaxRow,$T30)","v":0.24764399399535714},{"$f":"INDEX(LiveAvRow,$T30)","v":6.6402285429845109E-2},null,null,null,null,null,null,null,null,null,null,null,null,null,{"$f":"COLUMN(Q$474)","v":17}]
[{"$f":"INDEX(HeaderRow,$T31)","v":"Unconditional"},null,{"$f":"INDEX(LiveAllRow,$T31)","v":{"$error":"#DIV/0!"}},{"$f":"INDEX(LiveMinRow,$T31)","v":{"$error":"#DIV/0!"}},{"$f":"INDEX(LiveMaxRow,$T31)","v":{"$error":"#DIV/0!"}},{"$f":"INDEX(LiveAvRow,$T31)","v":{"$error":"#DIV/0!"}},null,null,null,null,null,null,null,null,null,null,null,null,null,{"$f":"COLUMN(R$474)","v":18}]
[{"$f":"INDEX(HeaderRow,$T32)","v":"Conditional"},null,{"$f":"INDEX(LiveAllRow,$T32)","v":{"$error":"#DIV/0!"}},{"$f":"INDEX(LiveMinRow,$T32)","v":{"$error":"#DIV/0!"}},{"$f":"INDEX(LiveMaxRow,$T32)","v":{"$error":"#DIV/0!"}},{"$f":"INDEX(LiveAvRow,$T32)","v":{"$error":"#DIV/0!"}},null,null,null,null,null,null,null,null,null,null,null,null,null,{"$f":"COLUMN(S$474)","v":19}]
[{"$f":"INDEX(HeaderRow,$T33)","v":"Face value"},null,{"$f":"INDEX(LiveAllRow,$T33)","v":{"$error":"#DIV/0!"}},{"$f":"INDEX(LiveMinRow,$T33)","v":{"$error":"#DIV/0!"}},{"$f":"INDEX(LiveMaxRow,$T33)","v":{"$error":"#DIV/0!"}},{"$f":"INDEX(LiveAvRow,$T33)","v":{"$error":"#DIV/0!"}},null,null,null,null,null,null,null,null,null,null,null,null,null,{"$f":"COLUMN(AI$474)","v":35}]
[{"$f":"INDEX(HeaderRow,$T34)","v":"On cost proportion"},null,{"$f":"INDEX(LiveAllRow,$T34)","v":0},{"$f":"INDEX(LiveMinRow,$T34)","v":0},{"$f":"INDEX(LiveMaxRow,$T34)","v":0},{"$f":"INDEX(LiveAvRow,$T34)","v":0},null,null,null,null,null,null,null,null,null,null,null,null,null,{"$f":"COLUMN(Y$474)","v":25}]
[{"$f":"\"LAST YEAR \"& UPPER(TEXT(LastYear,\"MMM YYYY\"))","v":"LAST YEAR DEC 2015"}]
["Number and Age",null,{"$f":"INDEX(LiveAllRow,$T36)","v":64},null,null,{"$f":"AL$482","v":49.743272569444436},null,null,null,null,null,null,null,null,null,null,null,null,null,{"$f":"COLUMN(AL130)","v":38}]
["Masculinity",null,null,null,null,{"$f":"AL$483","v":0.484375}]
[{"$f":"INDEX(HeaderRow,$T38)","v":"Salary (Full time)"},null,{"$f":"INDEX(LiveAllRow,$T38)","v":1982203},{"$f":"INDEX(LiveMinRow,$T38)","v":0},{"$f":"INDEX(LiveMaxRow,$T38)","v":54486},{"$f":"INDEX(LiveAvRow,$T38)","v":27918.352112676057},null,null,null,null,null,null,null,null,null,null,null,null,null,{"$f":"COLUMN(Z$474)","v":26}]
[{"$f":"INDEX(HeaderRow,$T39)","v":"Full time proportion accrued"},null,{"$f":"INDEX(LiveAllRow,$T39)","v":70},{"$f":"INDEX(LiveMinRow,$T39)","v":0},{"$f":"INDEX(LiveMaxRow,$T39)","v":1},{"$f":"INDEX(LiveAvRow,$T39)","v":0.9859154929577465},null,null,null,null,null,null,null,null,null,null,null,null,null,{"$f":"COLUMN(AA$474)","v":27}]
[{"$f":"INDEX(HeaderRow,$T40)","v":"Full time proportion accruing"},null,{"$f":"INDEX(LiveAllRow,$T40)","v":70},{"$f":"INDEX(LiveMinRow,$T40)","v":0},{"$f":"INDEX(LiveMaxRow,$T40)","v":1},{"$f":"INDEX(LiveAvRow,$T40)","v":0.9859154929577465},null,null,null,null,null,null,null,null,null,null,null,null,null,{"$f":"COLUMN(AB$474)","v":28}]
[{"$f":"A29","v":"Entitlement years before FTE adjustment"}]
[{"$f":"INDEX(HeaderRow,$T42)","v":"Preconditional"},null,{"$f":"INDEX(LiveAllRow,$T42)","v":1.7038116877674845},{"$f":"INDEX(LiveMinRow,$T42)","v":0},{"$f":"INDEX(LiveMaxRow,$T42)","v":0.2543478260869565},{"$f":"INDEX(LiveAvRow,$T42)","v":2.3997347715034992E-2},null,null,null,null,null,null,null,null,null,null,null,null,null,{"$f":"COLUMN(AC$474)","v":29}]
[{"$f":"INDEX(HeaderRow,$T43)","v":"Unconditional"},null,{"$f":"INDEX(LiveAllRow,$T43)","v":1.4804620267916877},{"$f":"INDEX(LiveMinRow,$T43)","v":0},{"$f":"INDEX(LiveMaxRow,$T43)","v":0.25},{"$f":"INDEX(LiveAvRow,$T43)","v":2.0851577842136447E-2},null,null,null,null,null,null,null,null,null,null,null,null,null,{"$f":"COLUMN(AD$474)","v":30}]
[{"$f":"INDEX(HeaderRow,$T44)","v":"Conditional"},null,{"$f":"INDEX(LiveAllRow,$T44)","v":1.7748441654302272},{"$f":"INDEX(LiveMinRow,$T44)","v":0},{"$f":"INDEX(LiveMaxRow,$T44)","v":0.2543478260869565},{"$f":"INDEX(LiveAvRow,$T44)","v":2.4997805146904608E-2},null,null,null,null,null,null,null,null,null,null,null,null,null,{"$f":"COLUMN(AE$474)","v":31}]
[{"$f":"INDEX(HeaderRow,$T45)","v":"On cost proportion"},null,{"$f":"INDEX(LiveAllRow,$T45)","v":6.6429999999999998},{"$f":"INDEX(LiveMinRow,$T45)","v":0},{"$f":"INDEX(LiveMaxRow,$T45)","v":9.4899999999999998E-2},{"$f":"INDEX(LiveAvRow,$T45)","v":9.3563380281690131E-2},null,null,null,null,null,null,null,null,null,null,null,null,null,{"$f":"COLUMN(AF$474)","v":32}]
[]
[]
[]
[]
[]
[]
[]
[]
[]
[]
[]
[]
[]
[]
[]
[]
[]
[]
[]
[]
[]
[]
[]
[]
[]
[]
[]
[]
[]
[]
[]
[]
[]
[]
[]
[]
[]
[]
[]
[]
[]
[]
[]
[]
[]
[]
[]
[]
[]
[]
[]
[]
[]
[]
[]
[]
[]
[]
[]
[]
[]
[]
[]
[]
[]
[]
[]
[null,null,null,null,null,null,null,null,null,null,null,null,"Valuation date information",null,null,null,null,null,null,null,null,null,null,null,null,null,"Previous valuation date information",null,null,null,null,null,"Live records"]
[null,null,null,null,null,null,null,null,null,null,null,null,null,null,null,null,"Entitlement years before FTE adjustment",null,null,null,null,null,null,null,null,null,null,null,"Entitlement years before FTE adjustment",null,null,null,"Valuation",null,null,null,null,"Previous"]
["Name","Reference","Sex","Birth date","Entry date","Exit date","Exit mode","Initial qualifying","Subsequent qualifying","Initial rate","Subsequent rate","Salary (Full time)","Full time proportion accrued","Full time proportion accruing","Last vesting date","Next vesting date","Preconditional","Unconditional","Conditional","Accrued annual leave","Annual leave accrual rate","Superannuation proportion","Workers compensation proportion","Payroll tax proportion","On cost proportion","Salary (Full time)","Full time proportion accrued","Full time proportion accruing","Preconditional","Unconditional","Conditional","On cost proportion","Number","Age","Face value","Service","Accrual","Number","Age"]
[{"$f":"[1]Sheet1!A2","v":"Abbott, Lisa"},{"$f":"[1]Sheet1!B2","v":"8000000"},{"$f":"[1]Sheet1!C2","v":"f"},{"$f":"[1]Sheet1!D2","v":"1981-01-20"},{"$f":"[1]Sheet1!L2","v":"2007-01-01"},"2099-12-31",null,7,7,0.25,0.25,{"$f":"[1]Sheet1!K2","v":64256},{"$f":"[1]Sheet1!I2","v":0.6},{"$f":"M116","v":0.6},{"$f":"[1]Sheet1!M2","v":"2014-04-27"},{"$f":"[1]Sheet1!R2","v":"2021-04-27"},{"$f":"IF(AJ116>0, IF(AJ116<H116, [1]Sheet1!Q2/L116/M116, 0),0)","v":0},{"$f":"IF(AJ116>0, IF(AJ116>=H116, [1]Sheet1!O2/L116/M116 -S116, 0),0)","v":9.3791694513197188E-2},{"$f":" IF(AJ116>H116, [1]Sheet1!Q2/L116/M116, 0)","v":9.7901598720119581E-2},{"$f":"VLOOKUP(B116, [2]Sheet1!$A$2:$K$359, 11, FALSE)","v":4.8958392009360505},null,null,null,null,null,54486,1,1,0,0.2491988767756855,0,9.4899999999999998E-2,{"$f":"IF($E116<=ValDate,1,0) * IF($F116>ValDate,1,IF($F116=0,1,0))","v":1},{"$f":"AG116*YEARFRAC($D116,ValDate)","v":35.947222222222223},{"$f":"L116*M116*SUM(Q116:S116)","v":7390.466550000001},{"$f":"AG116*YEARFRAC(E116,VaDate)","v":10},{"$f":"AG116*SUM(Q116:S116)","v":0.19169329323331677},{"$f":"IF($E116<=LastYear,1,0) * IF($F116>LastYear,1,IF($F116=0,1,0))","v":1},{"$f":"AL116*YEARFRAC($D116,LastYear)","v":34.947222222222223}]
[{"$f":"[1]Sheet1!A3","v":"Abdullah, Maree L"},{"$f":"[1]Sheet1!B3","v":"8000001"},{"$f":"[1]Sheet1!C3","v":"f"},{"$f":"[1]Sheet1!D3","v":"1977-05-05"},{"$f":"[1]Sheet1!L3","v":"2003-01-29"},"2099-12-31",null,7,7,0.25,0.25,{"$f":"[1]Sheet1!K3","v":57376},{"$f":"[1]Sheet1!I3","v":1},{"$f":"M117","v":1},{"$f":"[1]Sheet1!M3","v":"2010-05-03"},{"$f":"[1]Sheet1!R3","v":"2017-05-03"},{"$f":"IF(AJ117>0, IF(AJ117<H117, [1]Sheet1!Q3/L117/M117, 0),0)","v":0},{"$f":"IF(AJ117>0, IF(AJ117>=H117, [1]Sheet1!O3/L117/M117 -S117, 0),0)","v":-0.23733455552150104},{"$f":" IF(AJ117>H117, [1]Sheet1!Q3/L117/M117, 0)","v":0.23733455552150104},null,null,null,null,null,null,42306,1,1,0,0,7.1032477662742871E-2,9.4899999999999998E-2,1,39.655555555555559,0,13.922222222222222,0,1,38.655555555555559]
[{"$f":"[1]Sheet1!A4","v":"Adams, Kathrine J"},{"$f":"[1]Sheet1!B4","v":"8000003"},{"$f":"[1]Sheet1!C4","v":"f"},{"$f":"[1]Sheet1!D4","v":"1958-05-31"},{"$f":"[1]Sheet1!L4","v":"2012-03-05"},"2099-12-31",null,7,7,0.25,0.25,{"$f":"[1]Sheet1!K4","v":91152},{"$f":"[1]Sheet1!I4","v":1},1,{"$f":"[1]Sheet1!M4","v":"2015-11-05"},{"$f":"[1]Sheet1!R4","v":"2022-11-05"},{"$f":"IF(AJ118>0, IF(AJ118<H118, [1]Sheet1!Q4/L118/M118, 0),0)","v":4.4500226177401896E-2},{"$f":"IF(AJ118>0, IF(AJ118>=H118, [1]Sheet1!O4/L118/M118 -S118, 0),0)","v":0},{"$f":" IF(AJ118>H118, [1]Sheet1!Q4/L118/M118, 0)","v":0},null,null,null,null,null,null,37255,1,1,0.19567682190310023,0,0.19567682190310023,9.4899999999999998E-2,1,58.583333333333336,4056.2846165225374,4.822222222222222,4.4500226177401896E-2,1,57.583333333333336]
[{"$f":"[1]Sheet1!A5","v":"Adams, Stephen B"},{"$f":"[1]Sheet1!B5","v":"8000005"},{"$f":"[1]Sheet1!C5","v":"m"},{"$f":"[1]Sheet1!D5","v":"1957-02-07"},{"$f":"[1]Sheet1!L5","v":"2011-01-20"},"2099-12-31",null,7,7,0.25,0.25,{"$f":"[1]Sheet1!K5","v":94614},{"$f":"[1]Sheet1!I5","v":1},1,{"$f":"[1]Sheet1!M5","v":"2013-06-22"},{"$f":"[1]Sheet1!R5","v":"2020-06-22"},{"$f":"IF(AJ119>0, IF(AJ119<H119, [1]Sheet1!Q5/L119/M119, 0),0)","v":0.12756731870535717},{"$f":"IF(AJ119>0, IF(AJ119>=H119, [1]Sheet1!O5/L119/M119 -S119, 0),0)","v":0},{"$f":" IF(AJ119>H119, [1]Sheet1!Q5/L119/M119, 0)","v":0},null,null,null,null,null,null,33738,1,1,0,0,0,9.4899999999999998E-2,1,59.9,12069.654291988663,5.947222222222222,0.12756731870535717,1,58.9]
[{"$f":"[1]Sheet1!A6","v":"Addink, Paul M"},{"$f":"[1]Sheet1!B6","v":"8000006"},{"$f":"[1]Sheet1!C6","v":"m"},{"$f":"[1]Sheet1!D6","v":"1984-11-20"},{"$f":"[1]Sheet1!L6","v":"2015-01-19"},"2099-12-31",null,7,7,0.25,0.25,{"$f":"[1]Sheet1!K6","v":60781},{"$f":"[1]Sheet1!I6","v":1},1,{"$f":"[1]Sheet1!M6","v":"2015-06-03"},{"$f":"[1]Sheet1!R6","v":"2022-06-03"},{"$f":"IF(AJ120>0, IF(AJ120<H120, [1]Sheet1!Q6/L120/M120, 0),0)","v":5.9333638279056675E-2},{"$f":"IF(AJ120>0, IF(AJ120>=H120, [1]Sheet1!O6/L120/M120 -S120, 0),0)","v":0},{"$f":" IF(AJ120>H120, [1]Sheet1!Q6/L120/M120, 0)","v":0},null,null,null,null,null,null,36827,1,1,5.3219105547560215E-2,0,5.3219105547560215E-2,9.4899999999999998E-2,1,32.113888888888887,3606.3578682393436,1.95,5.9333638279056675E-2,1,31.113888888888887]
{"$rows_left_out":416}