{"text_format":"1","workbook":"xlsx","n_sheets":3,"sheets":["Calculation","Module2","Module1"],"not_rendered":{"charts":6,"images":1,"macros":1,"external_links":2,"defined_names":73,"comments":1,"pivot_tables":0},"unopened":[{"sheet":"Module2","index":1,"reason":"part_missing"},{"sheet":"Module1","index":2,"reason":"part_missing"}],"bounds":{"document_bytes":16777216,"sheet_cells":100000,"rows_first":2000,"rows_last":500,"rows_between":2000,"halvings":0,"cell_chars":16384,"cell_head_chars":4096},"cells_cut":0,"cells_raw":0,"read":"whole","date_system":"1900"}

{"sheet":"Calculation","index":0,"n_rows":536,"n_cols":39,"rows_kept":536,"cut":false,"hidden":false,"merged":[[481,1,482,2],[5,5,5,10]]}
[]
[null,"Barton Consultancy"]
[]
["Client name",null,null,null,"Instructions"]
[null,null,null,null,1,"Input valuation date."]
["Long service leave data",null,null,null,2,"Count records to be included in this spreadsheet remembering to include former employees for the last three years.",null,null,null,null,null,null,null,null,null,null,null,null,null,null,null,"This version created 15 Dec 2015"]
[null,null,null,null,3,"Make room for required number of records by clicking button to the right"]
[null,null,null,null,4,"Read comments describing input data."]
["Valuation date",null,"2016-12-31",null,5,"Populate input data",null,null,null,null,null,null,null,null,null,null,null,null,null,null,null,"Changes made in this version"]
["Last year",null,{"$f":"EOMONTH(ValDate,-12)","v":"2015-12-31"},null,6,"Check totals, maximum and minimum for reasonableness.  ",null,null,null,null,null,null,null,null,null,null,null,null,null,null,null,"Allow for background leave utilisation"]
[null,null,null,null,7,"Correct if necessary, guided by minimum and maximum rows .",null,null,null,null,null,null,null,null,null,null,null,null,null,null,null,"Allow for specification of previous and next anniversary "]
[null,null,null,null,8,"Check and print Data summary",null,null,null,null,null,null,null,null,null,null,null,null,null,null,null,"Allow for current LS leave to be split into next year and subsequent"]
[null,null,null,null,9,"Send to Barton@Actuary.com.au"]
[]
["Data summary "]
[]
[null,null,"All","Minimum","Maximum","Average",null,"Year end",{"$f":"EOMONTH(ValDate,-48)","v":"2012-12-31"},{"$f":"EOMONTH(ValDate,-36)","v":"2013-12-31"},{"$f":"EOMONTH(ValDate,-24)","v":"2014-12-31"},{"$f":"EOMONTH(ValDate,-12)","v":"2015-12-31"},{"$f":"ValDate","v":"2016-12-31"},"All","Crude"]
["Records",null,{"$f":"B474","v":358},null,null,null,null,"Begin",{"$f":"SUM(IF($E$116:$E$473<=EOMONTH(I$17,-12),1,0)*IF($F$116:$F$473=0,1,0)) + SUM(IF($E$116:$E$473<=EOMONTH(I$17,-12),1,0)*IF($F$116:$F$473>EOMONTH(I$17,-12),1,0))","v":211},{"$f":"SUM(IF($E$116:$E$473<=EOMONTH(J$17,-12),1,0)*IF($F$116:$F$473=0,1,0)) + SUM(IF($E$116:$E$473<=EOMONTH(J$17,-12),1,0)*IF($F$116:$F$473>EOMONTH(J$17,-12),1,0))","v":243},{"$f":"SUM(IF($E$116:$E$473<=EOMONTH(K$17,-12),1,0)*IF($F$116:$F$473=0,1,0)) + SUM(IF($E$116:$E$473<=EOMONTH(K$17,-12),1,0)*IF($F$116:$F$473>EOMONTH(K$17,-12),1,0))","v":263},{"$f":"SUM(IF($E$116:$E$473<=EOMONTH(L$17,-12),1,0)*IF($F$116:$F$473=0,1,0)) + SUM(IF($E$116:$E$473<=EOMONTH(L$17,-12),1,0)*IF($F$116:$F$473>EOMONTH(L$17,-12),1,0))","v":297},{"$f":"SUM(IF($E$116:$E$473<=EOMONTH(M$17,-12),1,0)*IF($F$116:$F$473=0,1,0)) + SUM(IF($E$116:$E$473<=EOMONTH(M$17,-12),1,0)*IF($F$116:$F$473>EOMONTH(M$17,-12),1,0))","v":328},{"$f":"I18","v":211}]
[{"$f":"\"VALUATION DATE \" & UPPER(TEXT(ValDate,\"MMM YYYY\"))  & \" CURRENT EMPLOYEES\"","v":"VALUATION DATE DEC 2016 CURRENT EMPLOYEES"},null,null,null,null,null,null,"New",{"$f":"SUM(IF($E$116:$E$473>EOMONTH(I$17,-12),1,0)*IF($E$116:$E$473<=I$17,1,0))","v":32},{"$f":"SUM(IF($E$116:$E$473>EOMONTH(J$17,-12),1,0)*IF($E$116:$E$473<=J$17,1,0))","v":20},{"$f":"SUM(IF($E$116:$E$473>EOMONTH(K$17,-12),1,0)*IF($E$116:$E$473<=K$17,1,0))","v":34},{"$f":"SUM(IF($E$116:$E$473>EOMONTH(L$17,-12),1,0)*IF($E$116:$E$473<=L$17,1,0))","v":31},{"$f":"SUM(IF($E$116:$E$473>EOMONTH(M$17,-12),1,0)*IF($E$116:$E$473<=M$17,1,0))","v":30},{"$f":"SUM(I19:M19)","v":147}]
["Number and Age",null,{"$f":"INDEX(LiveAllRow,$T20)","v":71},null,null,{"$f":"AG$482","v":50.637128325508591},null,"Death",{"$f":"SUM(IF($F$116:$F$473>EOMONTH(I$17,-12),1,0)*IF($F$116:$F$473<=I$17,1,0)* IF($G$116:$G$473=$V20,1,0))","v":0},{"$f":"SUM(IF($F$116:$F$473>EOMONTH(J$17,-12),1,0)*IF($F$116:$F$473<=J$17,1,0)* IF($G$116:$G$473=$V20,1,0))","v":0},{"$f":"SUM(IF($F$116:$F$473>EOMONTH(K$17,-12),1,0)*IF($F$116:$F$473<=K$17,1,0)* IF($G$116:$G$473=$V20,1,0))","v":0},{"$f":"SUM(IF($F$116:$F$473>EOMONTH(L$17,-12),1,0)*IF($F$116:$F$473<=L$17,1,0)* IF($G$116:$G$473=$V20,1,0))","v":0},{"$f":"SUM(IF($F$116:$F$473>EOMONTH(M$17,-12),1,0)*IF($F$116:$F$473<=M$17,1,0)* IF($G$116:$G$473=$V20,1,0))","v":0},0,{"$f":"N20/(N$26+N20/2)","v":0},null,null,null,null,{"$f":"COLUMN(AG115)","v":33},null,1]
["Masculinity",null,null,null,null,{"$f":"AG$483","v":0.47887323943661969},null,"Incapacity",{"$f":"SUM(IF($F$116:$F$473>EOMONTH(I$17,-12),1,0)*IF($F$116:$F$473<=I$17,1,0)* IF($G$116:$G$473=$V21,1,0))","v":0},{"$f":"SUM(IF($F$116:$F$473>EOMONTH(J$17,-12),1,0)*IF($F$116:$F$473<=J$17,1,0)* IF($G$116:$G$473=$V21,1,0))","v":0},{"$f":"SUM(IF($F$116:$F$473>EOMONTH(K$17,-12),1,0)*IF($F$116:$F$473<=K$17,1,0)* IF($G$116:$G$473=$V21,1,0))","v":0},{"$f":"SUM(IF($F$116:$F$473>EOMONTH(L$17,-12),1,0)*IF($F$116:$F$473<=L$17,1,0)* IF($G$116:$G$473=$V21,1,0))","v":0},{"$f":"SUM(IF($F$116:$F$473>EOMONTH(M$17,-12),1,0)*IF($F$116:$F$473<=M$17,1,0)* IF($G$116:$G$473=$V21,1,0))","v":0},0,{"$f":"N21/(N$26+N21/2)","v":0},null,null,null,null,null,null,2]
[{"$f":"INDEX(HeaderRow,$T22)","v":"Initial qualifying"},null,{"$f":"INDEX(LiveAllRow,$T22)","v":497},{"$f":"INDEX(LiveMinRow,$T22)","v":7},{"$f":"INDEX(LiveMaxRow,$T22)","v":7},{"$f":"INDEX(LiveAvRow,$T22)","v":7},null,"Retire",{"$f":"SUM(IF($F$116:$F$473>EOMONTH(I$17,-12),1,0)*IF($F$116:$F$473<=I$17,1,0)* IF($G$116:$G$473=$V22,1,0))","v":0},{"$f":"SUM(IF($F$116:$F$473>EOMONTH(J$17,-12),1,0)*IF($F$116:$F$473<=J$17,1,0)* IF($G$116:$G$473=$V22,1,0))","v":0},{"$f":"SUM(IF($F$116:$F$473>EOMONTH(K$17,-12),1,0)*IF($F$116:$F$473<=K$17,1,0)* IF($G$116:$G$473=$V22,1,0))","v":0},{"$f":"SUM(IF($F$116:$F$473>EOMONTH(L$17,-12),1,0)*IF($F$116:$F$473<=L$17,1,0)* IF($G$116:$G$473=$V22,1,0))","v":0},{"$f":"SUM(IF($F$116:$F$473>EOMONTH(M$17,-12),1,0)*IF($F$116:$F$473<=M$17,1,0)* IF($G$116:$G$473=$V22,1,0))","v":0},0,{"$f":"N22/(N$26+N22/2)","v":0},null,null,null,null,{"$f":"COLUMN(H$474)","v":8},null,3]
["Subsequent qualifying",null,497,7,7,7,null,"Retrench ",{"$f":"SUM(IF($F$116:$F$473>EOMONTH(I$17,-12),1,0)*IF($F$116:$F$473<=I$17,1,0)* IF($G$116:$G$473=$V23,1,0))","v":0},{"$f":"SUM(IF($F$116:$F$473>EOMONTH(J$17,-12),1,0)*IF($F$116:$F$473<=J$17,1,0)* IF($G$116:$G$473=$V23,1,0))","v":0},{"$f":"SUM(IF($F$116:$F$473>EOMONTH(K$17,-12),1,0)*IF($F$116:$F$473<=K$17,1,0)* IF($G$116:$G$473=$V23,1,0))","v":0},{"$f":"SUM(IF($F$116:$F$473>EOMONTH(L$17,-12),1,0)*IF($F$116:$F$473<=L$17,1,0)* IF($G$116:$G$473=$V23,1,0))","v":0},{"$f":"SUM(IF($F$116:$F$473>EOMONTH(M$17,-12),1,0)*IF($F$116:$F$473<=M$17,1,0)* IF($G$116:$G$473=$V23,1,0))","v":0},0,{"$f":"N23/(N$26+N23/2)","v":0},null,null,null,null,{"$f":"COLUMN(I$474)","v":9},null,4]
["Initial rate",null,17.75,0.25,0.25,0.25,null,"Other ",{"$f":"SUM(IF($F$116:$F$473>EOMONTH(I$17,-12),1,0)*IF($F$116:$F$473<=I$17,1,0)* IF($G$116:$G$473=$V24,1,0))","v":0},{"$f":"SUM(IF($F$116:$F$473>EOMONTH(J$17,-12),1,0)*IF($F$116:$F$473<=J$17,1,0)* IF($G$116:$G$473=$V24,1,0))","v":0},{"$f":"SUM(IF($F$116:$F$473>EOMONTH(K$17,-12),1,0)*IF($F$116:$F$473<=K$17,1,0)* IF($G$116:$G$473=$V24,1,0))","v":0},{"$f":"SUM(IF($F$116:$F$473>EOMONTH(L$17,-12),1,0)*IF($F$116:$F$473<=L$17,1,0)* IF($G$116:$G$473=$V24,1,0))","v":0},{"$f":"SUM(IF($F$116:$F$473>EOMONTH(M$17,-12),1,0)*IF($F$116:$F$473<=M$17,1,0)* IF($G$116:$G$473=$V24,1,0))","v":0},0,{"$f":"N24/(N$26+N24/2)","v":0},null,null,null,null,{"$f":"COLUMN(J$474)","v":10},null,5]
["Subsequent rate",null,17.75,0.25,0.25,0.25,null,"End",{"$f":"SUM(IF($E$116:$E$473<=I$17,1,0)*IF($F$116:$F$473=0,1,0)) + SUM(IF($E$116:$E$473<=I$17,1,0)*IF($F$116:$F$473>I$17,1,0))","v":243},{"$f":"SUM(IF($E$116:$E$473<=J$17,1,0)*IF($F$116:$F$473=0,1,0)) + SUM(IF($E$116:$E$473<=J$17,1,0)*IF($F$116:$F$473>J$17,1,0))","v":263},{"$f":"SUM(IF($E$116:$E$473<=K$17,1,0)*IF($F$116:$F$473=0,1,0)) + SUM(IF($E$116:$E$473<=K$17,1,0)*IF($F$116:$F$473>K$17,1,0))","v":297},{"$f":"SUM(IF($E$116:$E$473<=L$17,1,0)*IF($F$116:$F$473=0,1,0)) + SUM(IF($E$116:$E$473<=L$17,1,0)*IF($F$116:$F$473>L$17,1,0))","v":328},{"$f":"SUM(IF($E$116:$E$473<=M$17,1,0)*IF($F$116:$F$473=0,1,0)) + SUM(IF($E$116:$E$473<=M$17,1,0)*IF($F$116:$F$473>M$17,1,0))","v":358},{"$f":"M25","v":358},null,null,null,null,null,{"$f":"COLUMN(K$474)","v":11}]
["Salary (Full time)",null,6268555.9299999997,0,142609,88289.520140845067,null,"Central",{"$f":"(I25+I18)/2","v":227},{"$f":"(J25+J18)/2","v":253},{"$f":"(K25+K18)/2","v":280},{"$f":"(L25+L18)/2","v":312.5},{"$f":"(M25+M18)/2","v":343},1415.5,null,null,null,null,null,{"$f":"COLUMN(L$474)","v":12}]
["Full time proportion accrued",null,62.913799999999995,0,1,0.88610985915492946,null,null,null,null,null,null,null,null,null,null,null,null,null,{"$f":"COLUMN(M$474)","v":13}]
["Full time proportion accruing",null,62.913799999999995,0,1,0.88610985915492946,null,null,{"$f":"IF(I18+I19-SUM(I20:I24) = I25,\"ok\",\"Problem\")","v":"ok"},"ok","ok","ok","ok","ok",null,null,null,null,null,{"$f":"COLUMN(N$474)","v":14}]
[{"$f":"Q114","v":"Entitlement years before FTE adjustment"}]
[{"$f":"INDEX(HeaderRow,$T30)","v":"Preconditional"},null,{"$f":"INDEX(LiveAllRow,$T30)","v":4.7145622655190031},{"$f":"INDEX(LiveMinRow,$T30)","v":0},{"$f":"INDEX(LiveMaxRow,$T30)","v":0.24764399399535714},{"$f":"INDEX(LiveAvRow,$T30)","v":6.6402285429845109E-2},null,null,null,null,null,null,null,null,null,null,null,null,null,{"$f":"COLUMN(Q$474)","v":17}]
[{"$f":"INDEX(HeaderRow,$T31)","v":"Unconditional"},null,{"$f":"INDEX(LiveAllRow,$T31)","v":{"$error":"#DIV/0!"}},{"$f":"INDEX(LiveMinRow,$T31)","v":{"$error":"#DIV/0!"}},{"$f":"INDEX(LiveMaxRow,$T31)","v":{"$error":"#DIV/0!"}},{"$f":"INDEX(LiveAvRow,$T31)","v":{"$error":"#DIV/0!"}},null,null,null,null,null,null,null,null,null,null,null,null,null,{"$f":"COLUMN(R$474)","v":18}]
[{"$f":"INDEX(HeaderRow,$T32)","v":"Conditional"},null,{"$f":"INDEX(LiveAllRow,$T32)","v":{"$error":"#DIV/0!"}},{"$f":"INDEX(LiveMinRow,$T32)","v":{"$error":"#DIV/0!"}},{"$f":"INDEX(LiveMaxRow,$T32)","v":{"$error":"#DIV/0!"}},{"$f":"INDEX(LiveAvRow,$T32)","v":{"$error":"#DIV/0!"}},null,null,null,null,null,null,null,null,null,null,null,null,null,{"$f":"COLUMN(S$474)","v":19}]
[{"$f":"INDEX(HeaderRow,$T33)","v":"Face value"},null,{"$f":"INDEX(LiveAllRow,$T33)","v":{"$error":"#DIV/0!"}},{"$f":"INDEX(LiveMinRow,$T33)","v":{"$error":"#DIV/0!"}},{"$f":"INDEX(LiveMaxRow,$T33)","v":{"$error":"#DIV/0!"}},{"$f":"INDEX(LiveAvRow,$T33)","v":{"$error":"#DIV/0!"}},null,null,null,null,null,null,null,null,null,null,null,null,null,{"$f":"COLUMN(AI$474)","v":35}]
[{"$f":"INDEX(HeaderRow,$T34)","v":"On cost proportion"},null,{"$f":"INDEX(LiveAllRow,$T34)","v":0},{"$f":"INDEX(LiveMinRow,$T34)","v":0},{"$f":"INDEX(LiveMaxRow,$T34)","v":0},{"$f":"INDEX(LiveAvRow,$T34)","v":0},null,null,null,null,null,null,null,null,null,null,null,null,null,{"$f":"COLUMN(Y$474)","v":25}]
[{"$f":"\"LAST YEAR \"& UPPER(TEXT(LastYear,\"MMM YYYY\"))","v":"LAST YEAR DEC 2015"}]
["Number and Age",null,{"$f":"INDEX(LiveAllRow,$T36)","v":64},null,null,{"$f":"AL$482","v":49.743272569444436},null,null,null,null,null,null,null,null,null,null,null,null,null,{"$f":"COLUMN(AL130)","v":38}]
["Masculinity",null,null,null,null,{"$f":"AL$483","v":0.484375}]
[{"$f":"INDEX(HeaderRow,$T38)","v":"Salary (Full time)"},null,{"$f":"INDEX(LiveAllRow,$T38)","v":1982203},{"$f":"INDEX(LiveMinRow,$T38)","v":0},{"$f":"INDEX(LiveMaxRow,$T38)","v":54486},{"$f":"INDEX(LiveAvRow,$T38)","v":27918.352112676057},null,null,null,null,null,null,null,null,null,null,null,null,null,{"$f":"COLUMN(Z$474)","v":26}]
[{"$f":"INDEX(HeaderRow,$T39)","v":"Full time proportion accrued"},null,{"$f":"INDEX(LiveAllRow,$T39)","v":70},{"$f":"INDEX(LiveMinRow,$T39)","v":0},{"$f":"INDEX(LiveMaxRow,$T39)","v":1},{"$f":"INDEX(LiveAvRow,$T39)","v":0.9859154929577465},null,null,null,null,null,null,null,null,null,null,null,null,null,{"$f":"COLUMN(AA$474)","v":27}]
[{"$f":"INDEX(HeaderRow,$T40)","v":"Full time proportion accruing"},null,{"$f":"INDEX(LiveAllRow,$T40)","v":70},{"$f":"INDEX(LiveMinRow,$T40)","v":0},{"$f":"INDEX(LiveMaxRow,$T40)","v":1},{"$f":"INDEX(LiveAvRow,$T40)","v":0.9859154929577465},null,null,null,null,null,null,null,null,null,null,null,null,null,{"$f":"COLUMN(AB$474)","v":28}]
[{"$f":"A29","v":"Entitlement years before FTE adjustment"}]
[{"$f":"INDEX(HeaderRow,$T42)","v":"Preconditional"},null,{"$f":"INDEX(LiveAllRow,$T42)","v":1.7038116877674845},{"$f":"INDEX(LiveMinRow,$T42)","v":0},{"$f":"INDEX(LiveMaxRow,$T42)","v":0.2543478260869565},{"$f":"INDEX(LiveAvRow,$T42)","v":2.3997347715034992E-2},null,null,null,null,null,null,null,null,null,null,null,null,null,{"$f":"COLUMN(AC$474)","v":29}]
[{"$f":"INDEX(HeaderRow,$T43)","v":"Unconditional"},null,{"$f":"INDEX(LiveAllRow,$T43)","v":1.4804620267916877},{"$f":"INDEX(LiveMinRow,$T43)","v":0},{"$f":"INDEX(LiveMaxRow,$T43)","v":0.25},{"$f":"INDEX(LiveAvRow,$T43)","v":2.0851577842136447E-2},null,null,null,null,null,null,null,null,null,null,null,null,null,{"$f":"COLUMN(AD$474)","v":30}]
[{"$f":"INDEX(HeaderRow,$T44)","v":"Conditional"},null,{"$f":"INDEX(LiveAllRow,$T44)","v":1.7748441654302272},{"$f":"INDEX(LiveMinRow,$T44)","v":0},{"$f":"INDEX(LiveMaxRow,$T44)","v":0.2543478260869565},{"$f":"INDEX(LiveAvRow,$T44)","v":2.4997805146904608E-2},null,null,null,null,null,null,null,null,null,null,null,null,null,{"$f":"COLUMN(AE$474)","v":31}]
[{"$f":"INDEX(HeaderRow,$T45)","v":"On cost proportion"},null,{"$f":"INDEX(LiveAllRow,$T45)","v":6.6429999999999998},{"$f":"INDEX(LiveMinRow,$T45)","v":0},{"$f":"INDEX(LiveMaxRow,$T45)","v":9.4899999999999998E-2},{"$f":"INDEX(LiveAvRow,$T45)","v":9.3563380281690131E-2},null,null,null,null,null,null,null,null,null,null,null,null,null,{"$f":"COLUMN(AF$474)","v":32}]
[]
[]
[]
[]
[]
[]
[]
[]
[]
[]
[]
[]
[]
[]
[]
[]
[]
[]
[]
[]
[]
[]
[]
[]
[]
[]
[]
[]
[]
[]
[]
[]
[]
[]
[]
[]
[]
[]
[]
[]
[]
[]
[]
[]
[]
[]
[]
[]
[]
[]
[]
[]
[]
[]
[]
[]
[]
[]
[]
[]
[]
[]
[]
[]
[]
[]
[]
[null,null,null,null,null,null,null,null,null,null,null,null,"Valuation date information",null,null,null,null,null,null,null,null,null,null,null,null,null,"Previous valuation date information",null,null,null,null,null,"Live records"]
[null,null,null,null,null,null,null,null,null,null,null,null,null,null,null,null,"Entitlement years before FTE adjustment",null,null,null,null,null,null,null,null,null,null,null,"Entitlement years before FTE adjustment",null,null,null,"Valuation",null,null,null,null,"Previous"]
["Name","Reference","Sex","Birth date","Entry date","Exit date","Exit mode","Initial qualifying","Subsequent qualifying","Initial rate","Subsequent rate","Salary (Full time)","Full time proportion accrued","Full time proportion accruing","Last vesting date","Next vesting date","Preconditional","Unconditional","Conditional","Accrued annual leave","Annual leave accrual rate","Superannuation proportion","Workers compensation proportion","Payroll tax proportion","On cost proportion","Salary (Full time)","Full time proportion accrued","Full time proportion accruing","Preconditional","Unconditional","Conditional","On cost proportion","Number","Age","Face value","Service","Accrual","Number","Age"]
[{"$f":"[1]Sheet1!A2","v":"Abbott, Lisa"},{"$f":"[1]Sheet1!B2","v":"8000000"},{"$f":"[1]Sheet1!C2","v":"f"},{"$f":"[1]Sheet1!D2","v":"1981-01-20"},{"$f":"[1]Sheet1!L2","v":"2007-01-01"},"2099-12-31",null,7,7,0.25,0.25,{"$f":"[1]Sheet1!K2","v":64256},{"$f":"[1]Sheet1!I2","v":0.6},{"$f":"M116","v":0.6},{"$f":"[1]Sheet1!M2","v":"2014-04-27"},{"$f":"[1]Sheet1!R2","v":"2021-04-27"},{"$f":"IF(AJ116>0, IF(AJ116<H116, [1]Sheet1!Q2/L116/M116, 0),0)","v":0},{"$f":"IF(AJ116>0, IF(AJ116>=H116, [1]Sheet1!O2/L116/M116 -S116, 0),0)","v":9.3791694513197188E-2},{"$f":" IF(AJ116>H116, [1]Sheet1!Q2/L116/M116, 0)","v":9.7901598720119581E-2},{"$f":"VLOOKUP(B116, [2]Sheet1!$A$2:$K$359, 11, FALSE)","v":4.8958392009360505},null,null,null,null,null,54486,1,1,0,0.2491988767756855,0,9.4899999999999998E-2,{"$f":"IF($E116<=ValDate,1,0) * IF($F116>ValDate,1,IF($F116=0,1,0))","v":1},{"$f":"AG116*YEARFRAC($D116,ValDate)","v":35.947222222222223},{"$f":"L116*M116*SUM(Q116:S116)","v":7390.466550000001},{"$f":"AG116*YEARFRAC(E116,VaDate)","v":10},{"$f":"AG116*SUM(Q116:S116)","v":0.19169329323331677},{"$f":"IF($E116<=LastYear,1,0) * IF($F116>LastYear,1,IF($F116=0,1,0))","v":1},{"$f":"AL116*YEARFRAC($D116,LastYear)","v":34.947222222222223}]
[{"$f":"[1]Sheet1!A3","v":"Abdullah, Maree L"},{"$f":"[1]Sheet1!B3","v":"8000001"},{"$f":"[1]Sheet1!C3","v":"f"},{"$f":"[1]Sheet1!D3","v":"1977-05-05"},{"$f":"[1]Sheet1!L3","v":"2003-01-29"},"2099-12-31",null,7,7,0.25,0.25,{"$f":"[1]Sheet1!K3","v":57376},{"$f":"[1]Sheet1!I3","v":1},{"$f":"M117","v":1},{"$f":"[1]Sheet1!M3","v":"2010-05-03"},{"$f":"[1]Sheet1!R3","v":"2017-05-03"},{"$f":"IF(AJ117>0, IF(AJ117<H117, [1]Sheet1!Q3/L117/M117, 0),0)","v":0},{"$f":"IF(AJ117>0, IF(AJ117>=H117, [1]Sheet1!O3/L117/M117 -S117, 0),0)","v":-0.23733455552150104},{"$f":" IF(AJ117>H117, [1]Sheet1!Q3/L117/M117, 0)","v":0.23733455552150104},null,null,null,null,null,null,42306,1,1,0,0,7.1032477662742871E-2,9.4899999999999998E-2,1,39.655555555555559,0,13.922222222222222,0,1,38.655555555555559]
[{"$f":"[1]Sheet1!A4","v":"Adams, Kathrine J"},{"$f":"[1]Sheet1!B4","v":"8000003"},{"$f":"[1]Sheet1!C4","v":"f"},{"$f":"[1]Sheet1!D4","v":"1958-05-31"},{"$f":"[1]Sheet1!L4","v":"2012-03-05"},"2099-12-31",null,7,7,0.25,0.25,{"$f":"[1]Sheet1!K4","v":91152},{"$f":"[1]Sheet1!I4","v":1},1,{"$f":"[1]Sheet1!M4","v":"2015-11-05"},{"$f":"[1]Sheet1!R4","v":"2022-11-05"},{"$f":"IF(AJ118>0, IF(AJ118<H118, [1]Sheet1!Q4/L118/M118, 0),0)","v":4.4500226177401896E-2},{"$f":"IF(AJ118>0, IF(AJ118>=H118, [1]Sheet1!O4/L118/M118 -S118, 0),0)","v":0},{"$f":" IF(AJ118>H118, [1]Sheet1!Q4/L118/M118, 0)","v":0},null,null,null,null,null,null,37255,1,1,0.19567682190310023,0,0.19567682190310023,9.4899999999999998E-2,1,58.583333333333336,4056.2846165225374,4.822222222222222,4.4500226177401896E-2,1,57.583333333333336]
[{"$f":"[1]Sheet1!A5","v":"Adams, Stephen B"},{"$f":"[1]Sheet1!B5","v":"8000005"},{"$f":"[1]Sheet1!C5","v":"m"},{"$f":"[1]Sheet1!D5","v":"1957-02-07"},{"$f":"[1]Sheet1!L5","v":"2011-01-20"},"2099-12-31",null,7,7,0.25,0.25,{"$f":"[1]Sheet1!K5","v":94614},{"$f":"[1]Sheet1!I5","v":1},1,{"$f":"[1]Sheet1!M5","v":"2013-06-22"},{"$f":"[1]Sheet1!R5","v":"2020-06-22"},{"$f":"IF(AJ119>0, IF(AJ119<H119, [1]Sheet1!Q5/L119/M119, 0),0)","v":0.12756731870535717},{"$f":"IF(AJ119>0, IF(AJ119>=H119, [1]Sheet1!O5/L119/M119 -S119, 0),0)","v":0},{"$f":" IF(AJ119>H119, [1]Sheet1!Q5/L119/M119, 0)","v":0},null,null,null,null,null,null,33738,1,1,0,0,0,9.4899999999999998E-2,1,59.9,12069.654291988663,5.947222222222222,0.12756731870535717,1,58.9]
[{"$f":"[1]Sheet1!A6","v":"Addink, Paul M"},{"$f":"[1]Sheet1!B6","v":"8000006"},{"$f":"[1]Sheet1!C6","v":"m"},{"$f":"[1]Sheet1!D6","v":"1984-11-20"},{"$f":"[1]Sheet1!L6","v":"2015-01-19"},"2099-12-31",null,7,7,0.25,0.25,{"$f":"[1]Sheet1!K6","v":60781},{"$f":"[1]Sheet1!I6","v":1},1,{"$f":"[1]Sheet1!M6","v":"2015-06-03"},{"$f":"[1]Sheet1!R6","v":"2022-06-03"},{"$f":"IF(AJ120>0, IF(AJ120<H120, [1]Sheet1!Q6/L120/M120, 0),0)","v":5.9333638279056675E-2},{"$f":"IF(AJ120>0, IF(AJ120>=H120, [1]Sheet1!O6/L120/M120 -S120, 0),0)","v":0},{"$f":" IF(AJ120>H120, [1]Sheet1!Q6/L120/M120, 0)","v":0},null,null,null,null,null,null,36827,1,1,5.3219105547560215E-2,0,5.3219105547560215E-2,9.4899999999999998E-2,1,32.113888888888887,3606.3578682393436,1.95,5.9333638279056675E-2,1,31.113888888888887]
[{"$f":"[1]Sheet1!A7","v":"Alfred, Olufemi M"},{"$f":"[1]Sheet1!B7","v":"8000008"},{"$f":"[1]Sheet1!C7","v":"m"},{"$f":"[1]Sheet1!D7","v":"1970-07-31"},{"$f":"[1]Sheet1!L7","v":"2012-06-28"},"2099-12-31",null,7,7,0.25,0.25,{"$f":"[1]Sheet1!K7","v":109590},{"$f":"[1]Sheet1!I7","v":1},1,{"$f":"[1]Sheet1!M7","v":"2012-06-16"},{"$f":"[1]Sheet1!R7","v":"2019-06-16"},{"$f":"IF(AJ121>0, IF(AJ121<H121, [1]Sheet1!Q7/L121/M121, 0),0)","v":0.16316750441215083},{"$f":"IF(AJ121>0, IF(AJ121>=H121, [1]Sheet1!O7/L121/M121 -S121, 0),0)","v":0},{"$f":" IF(AJ121>H121, [1]Sheet1!Q7/L121/M121, 0)","v":0},null,null,null,null,null,null,37255,1,1,7.1102939202791579E-2,0,7.1102939202791579E-2,9.4899999999999998E-2,1,46.416666666666664,17881.526808527611,4.5083333333333337,0.16316750441215083,1,45.416666666666664]
[{"$f":"[1]Sheet1!A8","v":"Allen, Craig"},{"$f":"[1]Sheet1!B8","v":"8000010"},{"$f":"[1]Sheet1!C8","v":"m"},{"$f":"[1]Sheet1!D8","v":"1957-08-30"},{"$f":"[1]Sheet1!L8","v":"2007-05-07"},"2099-12-31",null,7,7,0.25,0.25,{"$f":"[1]Sheet1!K8","v":103122},{"$f":"[1]Sheet1!I8","v":1},1,{"$f":"[1]Sheet1!M8","v":"2014-09-29"},{"$f":"[1]Sheet1!R8","v":"2021-09-29"},{"$f":"IF(AJ122>0, IF(AJ122<H122, [1]Sheet1!Q8/L122/M122, 0),0)","v":0},{"$f":"IF(AJ122>0, IF(AJ122>=H122, [1]Sheet1!O8/L122/M122 -S122, 0),0)","v":-8.3067090702304905E-2},{"$f":" IF(AJ122>H122, [1]Sheet1!Q8/L122/M122, 0)","v":8.3067090702304905E-2},null,null,null,null,null,null,30917,1,1,0,0,0,9.4899999999999998E-2,1,59.333333333333336,0,9.65,0,1,58.333333333333336]
[{"$f":"[1]Sheet1!A9","v":"Alston, Elsa J"},{"$f":"[1]Sheet1!B9","v":"8000013"},{"$f":"[1]Sheet1!C9","v":"f"},{"$f":"[1]Sheet1!D9","v":"1971-06-02"},{"$f":"[1]Sheet1!L9","v":"2016-09-19"},"2099-12-31",null,7,7,0.25,0.25,{"$f":"[1]Sheet1!K9","v":67896},{"$f":"[1]Sheet1!I9","v":1},1,{"$f":"[1]Sheet1!M9","v":"2016-11-12"},{"$f":"[1]Sheet1!R9","v":"2023-11-12"},{"$f":"IF(AJ123>0, IF(AJ123<H123, [1]Sheet1!Q9/L123/M123, 0),0)","v":8.9000456004286951E-3},{"$f":"IF(AJ123>0, IF(AJ123>=H123, [1]Sheet1!O9/L123/M123 -S123, 0),0)","v":0},{"$f":" IF(AJ123>H123, [1]Sheet1!Q9/L123/M123, 0)","v":0},null,null,null,null,null,null,33738,1,1,0,0,0,9.4899999999999998E-2,1,45.580555555555556,604.27749608670672,0.28333333333333333,8.9000456004286951E-3,0,0]
[{"$f":"[1]Sheet1!A10","v":"Amos, Julie K"},{"$f":"[1]Sheet1!B10","v":"8000014"},{"$f":"[1]Sheet1!C10","v":"f"},{"$f":"[1]Sheet1!D10","v":"1968-01-18"},{"$f":"[1]Sheet1!L10","v":"2015-01-12"},"2099-12-31",null,7,7,0.25,0.25,{"$f":"[1]Sheet1!K10","v":78517},{"$f":"[1]Sheet1!I10","v":1},1,{"$f":"[1]Sheet1!M10","v":"2015-03-03"},{"$f":"[1]Sheet1!R10","v":"2022-03-03"},{"$f":"IF(AJ124>0, IF(AJ124<H124, [1]Sheet1!Q10/L124/M124, 0),0)","v":6.8233683923864655E-2},{"$f":"IF(AJ124>0, IF(AJ124>=H124, [1]Sheet1!O10/L124/M124 -S124, 0),0)","v":0},{"$f":" IF(AJ124>H124, [1]Sheet1!Q10/L124/M124, 0)","v":0},null,null,null,null,null,null,30917,1,1,0,0,0,9.4899999999999998E-2,1,48.952777777777776,5357.5041606500808,1.9694444444444446,6.8233683923864655E-2,1,47.952777777777776]
[{"$f":"[1]Sheet1!A11","v":"Anderson, Katherine B"},{"$f":"[1]Sheet1!B11","v":"8000015"},{"$f":"[1]Sheet1!C11","v":"f"},{"$f":"[1]Sheet1!D11","v":"1975-12-31"},{"$f":"[1]Sheet1!L11","v":"2016-09-05"},"2099-12-31",null,7,7,0.25,0.25,{"$f":"[1]Sheet1!K11","v":72204},{"$f":"[1]Sheet1!I11","v":0.5},0.5,{"$f":"[1]Sheet1!M11","v":"2016-11-12"},{"$f":"[1]Sheet1!R11","v":"2023-11-12"},{"$f":"IF(AJ125>0, IF(AJ125<H125, [1]Sheet1!Q11/L125/M125, 0),0)","v":8.9000453085063928E-3},{"$f":"IF(AJ125>0, IF(AJ125>=H125, [1]Sheet1!O11/L125/M125 -S125, 0),0)","v":0},{"$f":" IF(AJ125>H125, [1]Sheet1!Q11/L125/M125, 0)","v":0},null,null,null,null,null,null,30917,1,1,0,0,0,9.4899999999999998E-2,1,41,321.3094357276978,0.32222222222222224,8.9000453085063928E-3,0,0]
[{"$f":"[1]Sheet1!A12","v":"Anderson, Susan L"},{"$f":"[1]Sheet1!B12","v":"8000016"},{"$f":"[1]Sheet1!C12","v":"f"},{"$f":"[1]Sheet1!D12","v":"1964-05-21"},{"$f":"[1]Sheet1!L12","v":"2013-10-11"},"2099-12-31",null,7,7,0.25,0.25,{"$f":"[1]Sheet1!K12","v":80797},{"$f":"[1]Sheet1!I12","v":1},1,{"$f":"[1]Sheet1!M12","v":"2014-08-29"},{"$f":"[1]Sheet1!R12","v":"2021-08-29"},{"$f":"IF(AJ126>0, IF(AJ126<H126, [1]Sheet1!Q12/L126/M126, 0),0)","v":8.6033776162851988E-2},{"$f":"IF(AJ126>0, IF(AJ126>=H126, [1]Sheet1!O12/L126/M126 -S126, 0),0)","v":0},{"$f":" IF(AJ126>H126, [1]Sheet1!Q12/L126/M126, 0)","v":0},null,null,null,null,null,null,37255,1,1,0,0.24914776540061737,0,9.4899999999999998E-2,1,52.611111111111114,6951.2710126299517,3.2222222222222223,8.6033776162851988E-2,1,51.611111111111114]
[{"$f":"[1]Sheet1!A13","v":"Andrews, Shona C"},{"$f":"[1]Sheet1!B13","v":"8000017"},{"$f":"[1]Sheet1!C13","v":"f"},{"$f":"[1]Sheet1!D13","v":"1959-11-19"},{"$f":"[1]Sheet1!L13","v":"2007-11-16"},"2099-12-31",null,7,7,0.25,0.25,{"$f":"[1]Sheet1!K13","v":103122},{"$f":"[1]Sheet1!I13","v":1},1,{"$f":"[1]Sheet1!M13","v":"2016-01-06"},{"$f":"[1]Sheet1!R13","v":"2023-01-06"},{"$f":"IF(AJ127>0, IF(AJ127<H127, [1]Sheet1!Q13/L127/M127, 0),0)","v":0},{"$f":"IF(AJ127>0, IF(AJ127>=H127, [1]Sheet1!O13/L127/M127 -S127, 0),0)","v":0.21063441105074732},{"$f":" IF(AJ127>H127, [1]Sheet1!Q13/L127/M127, 0)","v":3.8566862699252649E-2},null,null,null,null,null,null,36827,1,1,3.5607027452684167E-2,0,3.5607027452684167E-2,9.4899999999999998E-2,1,57.116666666666667,25698.133751647496,9.125,0.24920127374999995,1,56.116666666666667]
[{"$f":"[1]Sheet1!A14","v":"Arnold, Lea"},{"$f":"[1]Sheet1!B14","v":"8000020"},{"$f":"[1]Sheet1!C14","v":"f"},{"$f":"[1]Sheet1!D14","v":"1986-07-04"},{"$f":"[1]Sheet1!L14","v":"2011-06-07"},"2099-12-31",null,7,7,0.25,0.25,{"$f":"[1]Sheet1!K14","v":73717},{"$f":"[1]Sheet1!I14","v":0.6},0.6,{"$f":"[1]Sheet1!M14","v":"2012-02-12"},{"$f":"[1]Sheet1!R14","v":"2019-02-12"},{"$f":"IF(AJ128>0, IF(AJ128<H128, [1]Sheet1!Q14/L128/M128, 0),0)","v":0.17503423179930147},{"$f":"IF(AJ128>0, IF(AJ128>=H128, [1]Sheet1!O14/L128/M128 -S128, 0),0)","v":0},{"$f":" IF(AJ128>H128, [1]Sheet1!Q14/L128/M128, 0)","v":0},null,null,null,null,null,null,30304,1,1,0.16111272439281943,0,0.16111272439281943,9.4899999999999998E-2,1,30.491666666666667,7741.799079329463,5.5666666666666664,0.17503423179930147,1,29.491666666666667]
[{"$f":"[1]Sheet1!A15","v":"Aslin, Michael J"},{"$f":"[1]Sheet1!B15","v":"8000022"},{"$f":"[1]Sheet1!C15","v":"m"},{"$f":"[1]Sheet1!D15","v":"1968-03-16"},{"$f":"[1]Sheet1!L15","v":"2014-10-13"},"2099-12-31",null,7,7,0.25,0.25,{"$f":"[1]Sheet1!K15","v":94614},{"$f":"[1]Sheet1!I15","v":1},1,{"$f":"[1]Sheet1!M15","v":"2014-11-30"},{"$f":"[1]Sheet1!R15","v":"2021-11-30"},{"$f":"IF(AJ129>0, IF(AJ129<H129, [1]Sheet1!Q15/L129/M129, 0),0)","v":7.7133727224155652E-2},{"$f":"IF(AJ129>0, IF(AJ129>=H129, [1]Sheet1!O15/L129/M129 -S129, 0),0)","v":0},{"$f":" IF(AJ129>H129, [1]Sheet1!Q15/L129/M129, 0)","v":0},null,null,null,null,null,null,16238,1,1,0,0,0,9.4899999999999998E-2,1,48.791666666666664,7297.9304675862631,2.2166666666666668,7.7133727224155652E-2,1,47.791666666666664]
[{"$f":"[1]Sheet1!A16","v":"Atterby, Kate V"},{"$f":"[1]Sheet1!B16","v":"8000024"},{"$f":"[1]Sheet1!C16","v":"f"},{"$f":"[1]Sheet1!D16","v":"1968-05-15"},{"$f":"[1]Sheet1!L16","v":"2016-07-29"},"2099-12-31",null,7,7,0.25,0.25,{"$f":"[1]Sheet1!K16","v":69781},{"$f":"[1]Sheet1!I16","v":1},1,{"$f":"[1]Sheet1!M16","v":"2016-09-11"},{"$f":"[1]Sheet1!R16","v":"2023-09-11"},{"$f":"IF(AJ130>0, IF(AJ130<H130, [1]Sheet1!Q16/L130/M130, 0),0)","v":1.4833409152554839E-2},{"$f":"IF(AJ130>0, IF(AJ130>=H130, [1]Sheet1!O16/L130/M130 -S130, 0),0)","v":0},{"$f":" IF(AJ130>H130, [1]Sheet1!Q16/L130/M130, 0)","v":0},null,null,null,null,null,null,10948,1,1,0,0,0,9.4899999999999998E-2,1,48.62777777777778,1035.0901240744292,0.42222222222222222,1.4833409152554839E-2,0,0]
[{"$f":"[1]Sheet1!A17","v":"Bailey, Kim N"},{"$f":"[1]Sheet1!B17","v":"8000026"},{"$f":"[1]Sheet1!C17","v":"f"},{"$f":"[1]Sheet1!D17","v":"1982-03-28"},{"$f":"[1]Sheet1!L17","v":"2015-01-01"},"2099-12-31",null,7,7,0.25,0.25,{"$f":"[1]Sheet1!K17","v":60781},{"$f":"[1]Sheet1!I17","v":0.69330000000000003},0.69330000000000003,{"$f":"[1]Sheet1!M17","v":"2015-08-04"},{"$f":"[1]Sheet1!R17","v":"2022-08-04"},{"$f":"IF(AJ131>0, IF(AJ131<H131, [1]Sheet1!Q17/L131/M131, 0),0)","v":5.3400274651972536E-2},{"$f":"IF(AJ131>0, IF(AJ131>=H131, [1]Sheet1!O17/L131/M131 -S131, 0),0)","v":0},{"$f":" IF(AJ131>H131, [1]Sheet1!Q17/L131/M131, 0)","v":0},null,null,null,null,null,null,6440,1,1,0.11304347826086956,0,0.11304347826086956,9.4899999999999998E-2,1,34.758333333333333,2250.2591275078157,2,5.3400274651972536E-2,1,33.758333333333333]
[{"$f":"[1]Sheet1!A18","v":"Barndon, Katie A"},{"$f":"[1]Sheet1!B18","v":"8000028"},{"$f":"[1]Sheet1!C18","v":"f"},{"$f":"[1]Sheet1!D18","v":"1987-08-30"},{"$f":"[1]Sheet1!L18","v":"2005-10-26"},"2099-12-31",null,7,7,0.25,0.25,{"$f":"[1]Sheet1!K18","v":64256},{"$f":"[1]Sheet1!I18","v":1},1,{"$f":"[1]Sheet1!M18","v":"2017-02-13"},{"$f":"[1]Sheet1!R18","v":"2024-02-13"},{"$f":"IF(AJ132>0, IF(AJ132<H132, [1]Sheet1!Q18/L132/M132, 0),0)","v":0},{"$f":"IF(AJ132>0, IF(AJ132>=H132, [1]Sheet1!O18/L132/M132 -S132, 0),0)","v":-4.0255591578996518E-2},{"$f":" IF(AJ132>H132, [1]Sheet1!Q18/L132/M132, 0)","v":0},null,null,null,null,null,null,13018,1,1,0.11304347826086956,0,0.11304347826086956,9.4899999999999998E-2,1,29.333333333333332,-2586.6632925000004,11.180555555555555,-4.0255591578996518E-2,1,28.333333333333332]
[{"$f":"[1]Sheet1!A19","v":"Bartlett, Jennifer R"},{"$f":"[1]Sheet1!B19","v":"8000031"},{"$f":"[1]Sheet1!C19","v":"f"},{"$f":"[1]Sheet1!D19","v":"1986-11-19"},{"$f":"[1]Sheet1!L19","v":"2014-08-11"},"2099-12-31",null,7,7,0.25,0.25,{"$f":"[1]Sheet1!K19","v":90896},{"$f":"[1]Sheet1!I19","v":1},1,{"$f":"[1]Sheet1!M19","v":"2014-12-31"},{"$f":"[1]Sheet1!R19","v":"2021-12-31"},{"$f":"IF(AJ133>0, IF(AJ133<H133, [1]Sheet1!Q19/L133/M133, 0),0)","v":7.4167048328274643E-2},{"$f":"IF(AJ133>0, IF(AJ133>=H133, [1]Sheet1!O19/L133/M133 -S133, 0),0)","v":0},{"$f":" IF(AJ133>H133, [1]Sheet1!Q19/L133/M133, 0)","v":0},null,null,null,null,null,null,16238,1,1,0,0,0,9.4899999999999998E-2,1,30.116666666666667,6741.4880248468517,2.3888888888888888,7.4167048328274643E-2,1,29.116666666666667]
[{"$f":"[1]Sheet1!A20","v":"Bassham, Alan T"},{"$f":"[1]Sheet1!B20","v":"8000032"},{"$f":"[1]Sheet1!C20","v":"m"},{"$f":"[1]Sheet1!D20","v":"1953-03-25"},{"$f":"[1]Sheet1!L20","v":"2015-02-16"},"2099-12-31",null,7,7,0.25,0.25,{"$f":"[1]Sheet1!K20","v":94614},{"$f":"[1]Sheet1!I20","v":1},1,{"$f":"[1]Sheet1!M20","v":"2015-04-03"},{"$f":"[1]Sheet1!R20","v":"2022-04-03"},{"$f":"IF(AJ134>0, IF(AJ134<H134, [1]Sheet1!Q20/L134/M134, 0),0)","v":6.5267000267857145E-2},{"$f":"IF(AJ134>0, IF(AJ134>=H134, [1]Sheet1!O20/L134/M134 -S134, 0),0)","v":0},{"$f":" IF(AJ134>H134, [1]Sheet1!Q20/L134/M134, 0)","v":0},null,null,null,null,null,null,24058,1,1,0.11304347826086956,0,0.11304347826086956,9.4899999999999998E-2,1,63.766666666666666,6175.1719633430357,1.875,6.5267000267857145E-2,1,62.766666666666666]
[{"$f":"[1]Sheet1!A21","v":"Battilana, Kellie F"},{"$f":"[1]Sheet1!B21","v":"8000033"},{"$f":"[1]Sheet1!C21","v":"f"},{"$f":"[1]Sheet1!D21","v":"1964-04-11"},{"$f":"[1]Sheet1!L21","v":"2006-01-09"},"2099-12-31",null,7,7,0.25,0.25,{"$f":"[1]Sheet1!K21","v":88830},{"$f":"[1]Sheet1!I21","v":0.75},0.75,{"$f":"[1]Sheet1!M21","v":"2013-05-22"},{"$f":"[1]Sheet1!R21","v":"2020-05-22"},{"$f":"IF(AJ135>0, IF(AJ135<H135, [1]Sheet1!Q21/L135/M135, 0),0)","v":0},{"$f":"IF(AJ135>0, IF(AJ135>=H135, [1]Sheet1!O21/L135/M135 -S135, 0),0)","v":-0.13053400236136464},{"$f":" IF(AJ135>H135, [1]Sheet1!Q21/L135/M135, 0)","v":0.13053400236136464},null,null,null,null,null,null,26496,1,1,9.5153985507246366E-2,0,9.5153985507246366E-2,9.4899999999999998E-2,1,52.722222222222221,0,10.977777777777778,0,1,51.722222222222221]
[{"$f":"[1]Sheet1!A22","v":"Baumgarten, Marion J"},{"$f":"[1]Sheet1!B22","v":"8000035"},{"$f":"[1]Sheet1!C22","v":"f"},{"$f":"[1]Sheet1!D22","v":"1966-04-29"},{"$f":"[1]Sheet1!L22","v":"2016-01-11"},"2099-12-31",null,7,7,0.25,0.25,{"$f":"[1]Sheet1!K22","v":98966},{"$f":"[1]Sheet1!I22","v":1},1,{"$f":"[1]Sheet1!M22","v":"2016-03-09"},{"$f":"[1]Sheet1!R22","v":"2023-03-09"},{"$f":"IF(AJ136>0, IF(AJ136<H136, [1]Sheet1!Q22/L136/M136, 0),0)","v":3.2633500054137482E-2},{"$f":"IF(AJ136>0, IF(AJ136>=H136, [1]Sheet1!O22/L136/M136 -S136, 0),0)","v":0},{"$f":" IF(AJ136>H136, [1]Sheet1!Q22/L136/M136, 0)","v":0},null,null,null,null,null,null,10442,1,1,2.4899444550852325E-3,0,2.4899444550852325E-3,9.4899999999999998E-2,1,50.672222222222224,3229.60696635777,0.97222222222222221,3.2633500054137482E-2,0,0]
[{"$f":"[1]Sheet1!A23","v":"Beamish, Stephen N"},{"$f":"[1]Sheet1!B23","v":"8000037"},{"$f":"[1]Sheet1!C23","v":"m"},{"$f":"[1]Sheet1!D23","v":"1958-05-10"},{"$f":"[1]Sheet1!L23","v":"2012-07-23"},"2099-12-31",null,7,7,0.25,0.25,{"$f":"[1]Sheet1!K23","v":103122},{"$f":"[1]Sheet1!I23","v":1},1,{"$f":"[1]Sheet1!M23","v":"2012-07-17"},{"$f":"[1]Sheet1!R23","v":"2019-07-17"},{"$f":"IF(AJ137>0, IF(AJ137<H137, [1]Sheet1!Q23/L137/M137, 0),0)","v":0.16020081975211087},{"$f":"IF(AJ137>0, IF(AJ137>=H137, [1]Sheet1!O23/L137/M137 -S137, 0),0)","v":0},{"$f":" IF(AJ137>H137, [1]Sheet1!Q23/L137/M137, 0)","v":0},null,null,null,null,null,null,8878,1,1,0,0,0,9.4899999999999998E-2,1,58.641666666666666,16520.228934477178,4.4388888888888891,0.16020081975211087,1,57.641666666666666]
[{"$f":"[1]Sheet1!A24","v":"Beaver, Ian J"},{"$f":"[1]Sheet1!B24","v":"8000040"},{"$f":"[1]Sheet1!C24","v":"m"},{"$f":"[1]Sheet1!D24","v":"1977-03-03"},{"$f":"[1]Sheet1!L24","v":"1997-07-29"},"2099-12-31",null,7,7,0.25,0.25,{"$f":"[1]Sheet1!K24","v":80797},{"$f":"[1]Sheet1!I24","v":1},1,{"$f":"[1]Sheet1!M24","v":"2012-07-17"},{"$f":"[1]Sheet1!R24","v":"2019-07-17"},{"$f":"IF(AJ138>0, IF(AJ138<H138, [1]Sheet1!Q24/L138/M138, 0),0)","v":0},{"$f":"IF(AJ138>0, IF(AJ138>=H138, [1]Sheet1!O24/L138/M138 -S138, 0),0)","v":-0.16020082311228803},{"$f":" IF(AJ138>H138, [1]Sheet1!Q24/L138/M138, 0)","v":0.16020082311228803},null,null,null,null,null,null,13432,1,1,9.6783799880881477E-4,0,9.6783799880881477E-4,9.4899999999999998E-2,1,39.827777777777776,0,19.422222222222221,0,1,38.827777777777776]
[{"$f":"[1]Sheet1!A25","v":"Begelhole, Alwyn R"},{"$f":"[1]Sheet1!B25","v":"8000041"},{"$f":"[1]Sheet1!C25","v":"m"},{"$f":"[1]Sheet1!D25","v":"1960-03-02"},{"$f":"[1]Sheet1!L25","v":"2011-08-29"},"2099-12-31",null,7,7,0.25,0.25,{"$f":"[1]Sheet1!K25","v":98211},{"$f":"[1]Sheet1!I25","v":1},1,{"$f":"[1]Sheet1!M25","v":"2011-10-12"},{"$f":"[1]Sheet1!R25","v":"2018-10-12"},{"$f":"IF(AJ139>0, IF(AJ139<H139, [1]Sheet1!Q25/L139/M139, 0),0)","v":0.18690095531250001},{"$f":"IF(AJ139>0, IF(AJ139>=H139, [1]Sheet1!O25/L139/M139 -S139, 0),0)","v":0},{"$f":" IF(AJ139>H139, [1]Sheet1!Q25/L139/M139, 0)","v":0},null,null,null,null,null,null,11040,1,1,0,0,0,9.4899999999999998E-2,1,56.830555555555556,18355.729722195938,5.3388888888888886,0.18690095531250001,1,55.830555555555556]
[{"$f":"[1]Sheet1!A26","v":"Bell, Johanna M"},{"$f":"[1]Sheet1!B26","v":"8000042"},{"$f":"[1]Sheet1!C26","v":"f"},{"$f":"[1]Sheet1!D26","v":"1964-05-05"},{"$f":"[1]Sheet1!L26","v":"2001-04-30"},"2099-12-31",null,7,7,0.25,0.25,{"$f":"[1]Sheet1!K26","v":107041},{"$f":"[1]Sheet1!I26","v":1},1,{"$f":"[1]Sheet1!M26","v":"2013-06-22"},{"$f":"[1]Sheet1!R26","v":"2020-06-22"},{"$f":"IF(AJ140>0, IF(AJ140<H140, [1]Sheet1!Q26/L140/M140, 0),0)","v":0},{"$f":"IF(AJ140>0, IF(AJ140>=H140, [1]Sheet1!O26/L140/M140 -S140, 0),0)","v":-0.12756731870535712},{"$f":" IF(AJ140>H140, [1]Sheet1!Q26/L140/M140, 0)","v":0.12756731870535712},null,null,null,null,null,null,8372,1,1,0,0,0,9.4899999999999998E-2,1,52.655555555555559,0,15.666666666666666,0,1,51.655555555555559]
[{"$f":"[1]Sheet1!A27","v":"Bellotti, Barry J"},{"$f":"[1]Sheet1!B27","v":"8000044"},{"$f":"[1]Sheet1!C27","v":"m"},{"$f":"[1]Sheet1!D27","v":"1981-09-06"},{"$f":"[1]Sheet1!L27","v":"2009-03-09"},"2099-12-31",null,7,7,0.25,0.25,{"$f":"[1]Sheet1!K27","v":80797},{"$f":"[1]Sheet1!I27","v":1},1,{"$f":"[1]Sheet1!M27","v":"2016-05-10"},{"$f":"[1]Sheet1!R27","v":"2023-05-10"},{"$f":"IF(AJ141>0, IF(AJ141<H141, [1]Sheet1!Q27/L141/M141, 0),0)","v":0},{"$f":"IF(AJ141>0, IF(AJ141>=H141, [1]Sheet1!O27/L141/M141 -S141, 0),0)","v":0.18416248436981361},{"$f":" IF(AJ141>H141, [1]Sheet1!Q27/L141/M141, 0)","v":2.6700136302983644E-2},null,null,null,null,null,null,15916,1,1,0,0,0,9.4899999999999998E-2,1,35.319444444444443,17037.0671625,7.8111111111111109,0.21086262067279726,1,34.319444444444443]
[{"$f":"[1]Sheet1!A28","v":"Bennett, Bronwyn M"},{"$f":"[1]Sheet1!B28","v":"8000046"},{"$f":"[1]Sheet1!C28","v":"f"},{"$f":"[1]Sheet1!D28","v":"1964-11-26"},{"$f":"[1]Sheet1!L28","v":"2010-11-22"},"2099-12-31",null,7,7,0.25,0.25,{"$f":"[1]Sheet1!K28","v":84599},{"$f":"[1]Sheet1!I28","v":1},1,{"$f":"[1]Sheet1!M28","v":"2011-02-06"},{"$f":"[1]Sheet1!R28","v":"2018-02-06"},{"$f":"IF(AJ142>0, IF(AJ142<H142, [1]Sheet1!Q28/L142/M142, 0),0)","v":0.21063441123331245},{"$f":"IF(AJ142>0, IF(AJ142>=H142, [1]Sheet1!O28/L142/M142 -S142, 0),0)","v":0},{"$f":" IF(AJ142>H142, [1]Sheet1!Q28/L142/M142, 0)","v":0},null,null,null,null,null,null,36296,1,1,0,0,0,9.4899999999999998E-2,1,52.097222222222221,17819.460555926998,6.1083333333333334,0.21063441123331245,1,51.097222222222221]
[{"$f":"[1]Sheet1!A29","v":"Benzie, Andrew"},{"$f":"[1]Sheet1!B29","v":"8000048"},{"$f":"[1]Sheet1!C29","v":"m"},{"$f":"[1]Sheet1!D29","v":"1963-07-18"},{"$f":"[1]Sheet1!L29","v":"2015-02-09"},"2099-12-31",null,7,7,0.25,0.25,{"$f":"[1]Sheet1!K29","v":78517},{"$f":"[1]Sheet1!I29","v":1},1,{"$f":"[1]Sheet1!M29","v":"2015-04-03"},{"$f":"[1]Sheet1!R29","v":"2022-04-03"},{"$f":"IF(AJ143>0, IF(AJ143<H143, [1]Sheet1!Q29/L143/M143, 0),0)","v":6.5267000267857145E-2},{"$f":"IF(AJ143>0, IF(AJ143>=H143, [1]Sheet1!O29/L143/M143 -S143, 0),0)","v":0},{"$f":" IF(AJ143>H143, [1]Sheet1!Q29/L143/M143, 0)","v":0},null,null,null,null,null,null,52104,1,1,0,0.25,0,9.4899999999999998E-2,1,53.452777777777776,5124.5690600313392,1.8944444444444444,6.5267000267857145E-2,1,52.452777777777776]
[{"$f":"[1]Sheet1!A30","v":"Bermingham, Patrick"},{"$f":"[1]Sheet1!B30","v":"8000049"},{"$f":"[1]Sheet1!C30","v":"m"},{"$f":"[1]Sheet1!D30","v":"1983-09-01"},{"$f":"[1]Sheet1!L30","v":"2013-09-02"},"2099-12-31",null,7,7,0.25,0.25,{"$f":"[1]Sheet1!K30","v":103122},{"$f":"[1]Sheet1!I30","v":1},1,{"$f":"[1]Sheet1!M30","v":"2013-09-23"},{"$f":"[1]Sheet1!R30","v":"2020-09-23"},{"$f":"IF(AJ144>0, IF(AJ144<H144, [1]Sheet1!Q30/L144/M144, 0),0)","v":0.11865266837655866},{"$f":"IF(AJ144>0, IF(AJ144>=H144, [1]Sheet1!O30/L144/M144 -S144, 0),0)","v":0},{"$f":" IF(AJ144>H144, [1]Sheet1!Q30/L144/M144, 0)","v":0},null,null,null,null,null,null,13800,1,1,2.8260869565217391E-2,0,2.8260869565217391E-2,9.4899999999999998E-2,1,33.333333333333336,12235.700468327483,3.3305555555555557,0.11865266837655866,1,32.333333333333336]
[{"$f":"[1]Sheet1!A31","v":"Bester, Johannes S"},{"$f":"[1]Sheet1!B31","v":"8000051"},{"$f":"[1]Sheet1!C31","v":"m"},{"$f":"[1]Sheet1!D31","v":"1974-08-22"},{"$f":"[1]Sheet1!L31","v":"2012-04-30"},"2099-12-31",null,7,7,0.25,0.25,{"$f":"[1]Sheet1!K31","v":98211},{"$f":"[1]Sheet1!I31","v":1},1,{"$f":"[1]Sheet1!M31","v":"2012-05-16"},{"$f":"[1]Sheet1!R31","v":"2019-05-16"},{"$f":"IF(AJ145>0, IF(AJ145<H145, [1]Sheet1!Q31/L145/M145, 0),0)","v":0.16613418323026016},{"$f":"IF(AJ145>0, IF(AJ145>=H145, [1]Sheet1!O31/L145/M145 -S145, 0),0)","v":0},{"$f":" IF(AJ145>H145, [1]Sheet1!Q31/L145/M145, 0)","v":0},null,null,null,null,null,null,27456,1,1,0.10545454545454545,0,0.10545454545454545,9.4899999999999998E-2,1,42.358333333333334,16316.204269227081,4.666666666666667,0.16613418323026016,1,41.358333333333334]
[{"$f":"[1]Sheet1!A32","v":"Blair, Diane E"},{"$f":"[1]Sheet1!B32","v":"8000057"},{"$f":"[1]Sheet1!C32","v":"f"},{"$f":"[1]Sheet1!D32","v":"1971-04-11"},{"$f":"[1]Sheet1!L32","v":"2008-02-05"},"2099-12-31",null,7,7,0.25,0.25,{"$f":"[1]Sheet1!K32","v":64256},{"$f":"[1]Sheet1!I32","v":1},1,{"$f":"[1]Sheet1!M32","v":"2015-09-04"},{"$f":"[1]Sheet1!R32","v":"2022-09-04"},{"$f":"IF(AJ146>0, IF(AJ146<H146, [1]Sheet1!Q32/L146/M146, 0),0)","v":0},{"$f":"IF(AJ146>0, IF(AJ146>=H146, [1]Sheet1!O32/L146/M146 -S146, 0),0)","v":0.19876768620548652},{"$f":" IF(AJ146>H146, [1]Sheet1!Q32/L146/M146, 0)","v":5.0433594997825307E-2},null,null,null,null,null,null,10212,1,1,2.8260869565217395E-2,0,2.8260869565217395E-2,9.4899999999999998E-2,1,45.722222222222221,16012.677525000003,8.905555555555555,0.24920128120331181,1,44.722222222222221]
[{"$f":"[1]Sheet1!A33","v":"Blechynden, Brian A"},{"$f":"[1]Sheet1!B33","v":"8000058"},{"$f":"[1]Sheet1!C33","v":"m"},{"$f":"[1]Sheet1!D33","v":"1980-03-09"},{"$f":"[1]Sheet1!L33","v":"2014-01-28"},"2099-12-31",null,7,7,0.25,0.25,{"$f":"[1]Sheet1!K33","v":93994},{"$f":"[1]Sheet1!I33","v":1},1,{"$f":"[1]Sheet1!M33","v":"2014-02-24"},{"$f":"[1]Sheet1!R33","v":"2021-02-24"},{"$f":"IF(AJ147>0, IF(AJ147<H147, [1]Sheet1!Q33/L147/M147, 0),0)","v":0.10383386699001984},{"$f":"IF(AJ147>0, IF(AJ147>=H147, [1]Sheet1!O33/L147/M147 -S147, 0),0)","v":0},{"$f":" IF(AJ147>H147, [1]Sheet1!Q33/L147/M147, 0)","v":0},null,null,null,null,null,null,37128,1,1,0,0.25,0,9.4899999999999998E-2,1,36.81111111111111,9759.7604938599252,2.9249999999999998,0.10383386699001984,1,35.81111111111111]
[{"$f":"[1]Sheet1!A34","v":"Bone, Keith R"},{"$f":"[1]Sheet1!B34","v":"8000059"},{"$f":"[1]Sheet1!C34","v":"m"},{"$f":"[1]Sheet1!D34","v":"1948-06-30"},{"$f":"[1]Sheet1!L34","v":"2010-01-11"},"2099-12-31",null,7,7,0.25,0.25,{"$f":"[1]Sheet1!K34","v":103122},{"$f":"[1]Sheet1!I34","v":1},1,{"$f":"[1]Sheet1!M34","v":"2010-01-30"},{"$f":"[1]Sheet1!R34","v":"2017-01-30"},{"$f":"IF(AJ148>0, IF(AJ148<H148, [1]Sheet1!Q34/L148/M148, 0),0)","v":0.24623459210220791},{"$f":"IF(AJ148>0, IF(AJ148>=H148, [1]Sheet1!O34/L148/M148 -S148, 0),0)","v":0},{"$f":" IF(AJ148>H148, [1]Sheet1!Q34/L148/M148, 0)","v":0},null,null,null,null,null,null,25806,1,1,8.4782608695652184E-2,0,8.4782608695652184E-2,9.4899999999999998E-2,1,{"$f":"AG148*YEARFRAC($D148,ValDate)","v":68.5},{"$f":"L148*M148*SUM(Q148:S148)","v":25392.203606763884},{"$f":"AG148*YEARFRAC(E148,VaDate)","v":6.9722222222222223},{"$f":"AG148*SUM(Q148:S148)","v":0.24623459210220791},1,{"$f":"AL148*YEARFRAC($D148,LastYear)","v":67.5}]
[{"$f":"[1]Sheet1!A35","v":"Bone, Tracey A"},{"$f":"[1]Sheet1!B35","v":"8000060"},{"$f":"[1]Sheet1!C35","v":"f"},{"$f":"[1]Sheet1!D35","v":"1963-05-16"},{"$f":"[1]Sheet1!L35","v":"1996-02-01"},"2099-12-31",null,7,7,0.25,0.25,{"$f":"[1]Sheet1!K35","v":109590},{"$f":"[1]Sheet1!I35","v":1},1,{"$f":"[1]Sheet1!M35","v":"2014-10-19"},{"$f":"[1]Sheet1!R35","v":"2021-10-19"},{"$f":"IF(AJ149>0, IF(AJ149<H149, [1]Sheet1!Q35/L149/M149, 0),0)","v":0},{"$f":"IF(AJ149>0, IF(AJ149>=H149, [1]Sheet1!O35/L149/M149 -S149, 0),0)","v":-5.8100594443734749E-2},{"$f":" IF(AJ149>H149, [1]Sheet1!Q35/L149/M149, 0)","v":8.111145735750426E-2},null,null,null,null,null,null,37128,1,1,0.125,0,0.125,9.4899999999999998E-2,1,53.625,2521.7604667200007,20.916666666666668,2.3010862913769511E-2,1,52.625]
[{"$f":"[1]Sheet1!A36","v":"Boston, Elizabeth A"},{"$f":"[1]Sheet1!B36","v":"8000062"},{"$f":"[1]Sheet1!C36","v":"f"},{"$f":"[1]Sheet1!D36","v":"1960-01-03"},{"$f":"[1]Sheet1!L36","v":"2000-04-10"},"2099-12-31",null,7,7,0.25,0.25,{"$f":"[1]Sheet1!K36","v":105816},{"$f":"[1]Sheet1!I36","v":1},1,{"$f":"[1]Sheet1!M36","v":"2011-10-11"},{"$f":"[1]Sheet1!R36","v":"2018-10-11"},{"$f":"IF(AJ150>0, IF(AJ150<H150, [1]Sheet1!Q36/L150/M150, 0),0)","v":0},{"$f":"IF(AJ150>0, IF(AJ150>=H150, [1]Sheet1!O36/L150/M150 -S150, 0),0)","v":-7.5718850570715396E-2},{"$f":" IF(AJ150>H150, [1]Sheet1!Q36/L150/M150, 0)","v":0.18690095732071541},null,null,null,null,null,null,28496,1,1,0,0.25,0,9.4899999999999998E-2,1,56.994444444444447,11764.845807858001,16.725000000000001,0.11118210675000001,1,55.994444444444447]
[{"$f":"[1]Sheet1!A37","v":"Boston, James"},{"$f":"[1]Sheet1!B37","v":"8000063"},{"$f":"[1]Sheet1!C37","v":"m"},{"$f":"[1]Sheet1!D37","v":"1947-07-08"},{"$f":"[1]Sheet1!L37","v":"2006-02-15"},"2099-12-31",null,7,7,0.25,0.25,{"$f":"[1]Sheet1!K37","v":84599},{"$f":"[1]Sheet1!I37","v":0.43},0.43,{"$f":"[1]Sheet1!M37","v":"2016-01-06"},{"$f":"[1]Sheet1!R37","v":"2023-01-06"},{"$f":"IF(AJ151>0, IF(AJ151<H151, [1]Sheet1!Q37/L151/M151, 0),0)","v":0},{"$f":"IF(AJ151>0, IF(AJ151>=H151, [1]Sheet1!O37/L151/M151 -S151, 0),0)","v":0.18763121655074741},{"$f":" IF(AJ151>H151, [1]Sheet1!Q37/L151/M151, 0)","v":3.8566862699252642E-2},null,null,null,null,null,null,13018,1,1,0.2543478260869565,0,0.2543478260869565,9.4899999999999998E-2,1,69.480555555555554,8228.5364617824234,10.877777777777778,0.22619807925000004,1,68.480555555555554]
[{"$f":"[1]Sheet1!A38","v":"Boston, Penelope F"},{"$f":"[1]Sheet1!B38","v":"8000064"},{"$f":"[1]Sheet1!C38","v":"f"},{"$f":"[1]Sheet1!D38","v":"1955-01-18"},{"$f":"[1]Sheet1!L38","v":"2005-07-11"},"2099-12-31",null,7,7,0.25,0.25,{"$f":"[1]Sheet1!K38","v":94614},{"$f":"[1]Sheet1!I38","v":1},1,{"$f":"[1]Sheet1!M38","v":"2013-04-21"},{"$f":"[1]Sheet1!R38","v":"2020-04-21"},{"$f":"IF(AJ152>0, IF(AJ152<H152, [1]Sheet1!Q38/L152/M152, 0),0)","v":0},{"$f":"IF(AJ152>0, IF(AJ152>=H152, [1]Sheet1!O38/L152/M152 -S152, 0),0)","v":-0.13350068218350639},{"$f":" IF(AJ152>H152, [1]Sheet1!Q38/L152/M152, 0)","v":0.13350068218350639},null,null,null,null,null,null,9724,1,1,0,0,0,9.4899999999999998E-2,1,61.952777777777776,0,11.472222222222221,0,1,60.952777777777776]
[{"$f":"[1]Sheet1!A39","v":"Bowen, Janette M"},{"$f":"[1]Sheet1!B39","v":"8000067"},{"$f":"[1]Sheet1!C39","v":"f"},{"$f":"[1]Sheet1!D39","v":"1958-01-20"},{"$f":"[1]Sheet1!L39","v":"1996-02-20"},"2099-12-31",null,7,7,0.25,0.25,{"$f":"[1]Sheet1!K39","v":111106},{"$f":"[1]Sheet1!I39","v":1},1,{"$f":"[1]Sheet1!M39","v":"2010-12-06"},{"$f":"[1]Sheet1!R39","v":"2017-12-06"},{"$f":"IF(AJ153>0, IF(AJ153<H153, [1]Sheet1!Q39/L153/M153, 0),0)","v":0},{"$f":"IF(AJ153>0, IF(AJ153>=H153, [1]Sheet1!O39/L153/M153 -S153, 0),0)","v":-0.21656777471146163},{"$f":" IF(AJ153>H153, [1]Sheet1!Q39/L153/M153, 0)","v":0.21656777471146163},null,null,null,null,null,null,42172,1,1,0,0.23211538461538461,0,9.4899999999999998E-2,1,58.947222222222223,0,20.863888888888887,0,1,57.947222222222223]
[{"$f":"[1]Sheet1!A40","v":"Bowman, Michael J"},{"$f":"[1]Sheet1!B40","v":"8000068"},{"$f":"[1]Sheet1!C40","v":"m"},{"$f":"[1]Sheet1!D40","v":"1975-10-24"},{"$f":"[1]Sheet1!L40","v":"2016-04-11"},"2099-12-31",null,7,7,0.25,0.25,{"$f":"[1]Sheet1!K40","v":124033},{"$f":"[1]Sheet1!I40","v":1},1,{"$f":"[1]Sheet1!M40","v":"2012-12-19"},{"$f":"[1]Sheet1!R40","v":"2019-12-19"},{"$f":"IF(AJ154>0, IF(AJ154<H154, [1]Sheet1!Q40/L154/M154, 0),0)","v":0.14536741278686102},{"$f":"IF(AJ154>0, IF(AJ154>=H154, [1]Sheet1!O40/L154/M154 -S154, 0),0)","v":0},{"$f":" IF(AJ154>H154, [1]Sheet1!Q40/L154/M154, 0)","v":0},null,null,null,null,null,null,36712,1,1,3.8461538461538464E-2,0,3.8461538461538464E-2,9.4899999999999998E-2,1,41.18611111111111,18030.356310192732,0.72222222222222221,0.14536741278686102,0,0]
[{"$f":"[1]Sheet1!A41","v":"Boyes, Susan J"},{"$f":"[1]Sheet1!B41","v":"8000069"},{"$f":"[1]Sheet1!C41","v":"f"},{"$f":"[1]Sheet1!D41","v":"1947-01-19"},{"$f":"[1]Sheet1!L41","v":"2008-07-23"},"2099-12-31",null,7,7,0.25,0.25,{"$f":"[1]Sheet1!K41","v":64256},{"$f":"[1]Sheet1!I41","v":0.64049999999999996},0.64049999999999996,{"$f":"[1]Sheet1!M41","v":"2015-12-06"},{"$f":"[1]Sheet1!R41","v":"2022-12-06"},{"$f":"IF(AJ155>0, IF(AJ155<H155, [1]Sheet1!Q41/L155/M155, 0),0)","v":0},{"$f":"IF(AJ155>0, IF(AJ155>=H155, [1]Sheet1!O41/L155/M155 -S155, 0),0)","v":6.198083074851226E-2},{"$f":" IF(AJ155>H155, [1]Sheet1!Q41/L155/M155, 0)","v":4.15335475974788E-2},null,null,null,null,null,null,29348,1,1,8.478260869565217E-2,0,8.478260869565217E-2,9.4899999999999998E-2,1,69.95,4260.2344427475009,8.4388888888888882,0.10351437834599106,1,68.95]
[{"$f":"[1]Sheet1!A42","v":"Brady, Andre A"},{"$f":"[1]Sheet1!B42","v":"8000070"},{"$f":"[1]Sheet1!C42","v":"m"},{"$f":"[1]Sheet1!D42","v":"1964-12-19"},{"$f":"[1]Sheet1!L42","v":"2012-07-06"},"2099-12-31",null,7,7,0.25,0.25,{"$f":"[1]Sheet1!K42","v":98211},{"$f":"[1]Sheet1!I42","v":1},1,{"$f":"[1]Sheet1!M42","v":"2012-07-17"},{"$f":"[1]Sheet1!R42","v":"2019-07-17"},{"$f":"IF(AJ156>0, IF(AJ156<H156, [1]Sheet1!Q42/L156/M156, 0),0)","v":0.1602008197521109},{"$f":"IF(AJ156>0, IF(AJ156>=H156, [1]Sheet1!O42/L156/M156 -S156, 0),0)","v":0},{"$f":" IF(AJ156>H156, [1]Sheet1!Q42/L156/M156, 0)","v":0},null,null,null,null,null,null,28996,1,1,0,0,0,9.4899999999999998E-2,1,52.033333333333331,15733.482708674563,4.4861111111111107,0.1602008197521109,1,51.033333333333331]
[{"$f":"[1]Sheet1!A43","v":"Brearley, Samantha D"},{"$f":"[1]Sheet1!B43","v":"8000072"},{"$f":"[1]Sheet1!C43","v":"f"},{"$f":"[1]Sheet1!D43","v":"1971-12-06"},{"$f":"[1]Sheet1!L43","v":"1988-03-14"},"2099-12-31",null,7,7,0.25,0.25,{"$f":"[1]Sheet1!K43","v":73717},{"$f":"[1]Sheet1!I43","v":0.9},0.9,{"$f":"[1]Sheet1!M43","v":"2011-12-13"},{"$f":"[1]Sheet1!R43","v":"2018-12-13"},{"$f":"IF(AJ157>0, IF(AJ157<H157, [1]Sheet1!Q43/L157/M157, 0),0)","v":0},{"$f":"IF(AJ157>0, IF(AJ157>=H157, [1]Sheet1!O43/L157/M157 -S157, 0),0)","v":-0.16173946229438799},{"$f":" IF(AJ157>H157, [1]Sheet1!Q43/L157/M157, 0)","v":0.1809454050404235},null,null,null,null,null,null,9856,1,1,0,0,0,9.4899999999999998E-2,1,45.069444444444443,1274.2240332685501,28.797222222222221,1.9205942746035515E-2,1,44.069444444444443]
[{"$f":"[1]Sheet1!A44","v":"Brennan, Linda J"},{"$f":"[1]Sheet1!B44","v":"8000073"},{"$f":"[1]Sheet1!C44","v":"f"},{"$f":"[1]Sheet1!D44","v":"1982-03-21"},{"$f":"[1]Sheet1!L44","v":"2014-10-01"},"2099-12-31",null,7,7,0.25,0.25,{"$f":"[1]Sheet1!K44","v":71723},{"$f":"[1]Sheet1!I44","v":0.6},0.6,{"$f":"[1]Sheet1!M44","v":"2014-10-30"},{"$f":"[1]Sheet1!R44","v":"2021-10-30"},{"$f":"IF(AJ158>0, IF(AJ158<H158, [1]Sheet1!Q44/L158/M158, 0),0)","v":8.0100413592960412E-2},{"$f":"IF(AJ158>0, IF(AJ158>=H158, [1]Sheet1!O44/L158/M158 -S158, 0),0)","v":0},{"$f":" IF(AJ158>H158, [1]Sheet1!Q44/L158/M158, 0)","v":0},null,null,null,null,null,null,9812,1,1,0,0,0,9.4899999999999998E-2,1,34.777777777777779,3447.0251784767393,2.25,8.0100413592960412E-2,1,33.777777777777779]
[{"$f":"[1]Sheet1!A45","v":"Brennan, Mitchell M"},{"$f":"[1]Sheet1!B45","v":"8000074"},{"$f":"[1]Sheet1!C45","v":"m"},{"$f":"[1]Sheet1!D45","v":"1985-11-06"},{"$f":"[1]Sheet1!L45","v":"2011-01-01"},"2099-12-31",null,7,7,0.25,0.25,{"$f":"[1]Sheet1!K45","v":124033},{"$f":"[1]Sheet1!I45","v":1},1,{"$f":"[1]Sheet1!M45","v":"2011-01-06"},{"$f":"[1]Sheet1!R45","v":"2018-01-06"},{"$f":"IF(AJ159>0, IF(AJ159<H159, [1]Sheet1!Q45/L159/M159, 0),0)","v":0.21360109641439379},{"$f":"IF(AJ159>0, IF(AJ159>=H159, [1]Sheet1!O45/L159/M159 -S159, 0),0)","v":0},{"$f":" IF(AJ159>H159, [1]Sheet1!Q45/L159/M159, 0)","v":0},null,null,null,null,null,null,37128,1,1,0,0,0,9.4899999999999998E-2,1,31.152777777777779,26493.584791566504,6,0.21360109641439379,1,30.152777777777779]
[{"$f":"[1]Sheet1!A46","v":"Brieden, Thomas"},{"$f":"[1]Sheet1!B46","v":"8000076"},{"$f":"[1]Sheet1!C46","v":"m"},{"$f":"[1]Sheet1!D46","v":"1964-08-11"},{"$f":"[1]Sheet1!L46","v":"2011-01-10"},"2099-12-31",null,7,7,0.25,0.25,{"$f":"[1]Sheet1!K46","v":107041},{"$f":"[1]Sheet1!I46","v":1},1,{"$f":"[1]Sheet1!M46","v":"2012-11-18"},{"$f":"[1]Sheet1!R46","v":"2019-11-18"},{"$f":"IF(AJ160>0, IF(AJ160<H160, [1]Sheet1!Q46/L160/M160, 0),0)","v":0.14833409279581233},{"$f":"IF(AJ160>0, IF(AJ160>=H160, [1]Sheet1!O46/L160/M160 -S160, 0),0)","v":0},{"$f":" IF(AJ160>H160, [1]Sheet1!Q46/L160/M160, 0)","v":0},null,null,null,null,null,null,9944,1,1,0,0,0,9.4899999999999998E-2,1,52.388888888888886,15877.829626956547,5.9749999999999996,0.14833409279581233,1,51.388888888888886]
[{"$f":"[1]Sheet1!A47","v":"Buhlmann, Thomas"},{"$f":"[1]Sheet1!B47","v":"8000084"},{"$f":"[1]Sheet1!C47","v":"m"},{"$f":"[1]Sheet1!D47","v":"1972-04-07"},{"$f":"[1]Sheet1!L47","v":"2008-08-18"},"2099-12-31",null,7,7,0.25,0.25,{"$f":"[1]Sheet1!K47","v":111106},{"$f":"[1]Sheet1!I47","v":1},1,{"$f":"[1]Sheet1!M47","v":"2016-07-11"},{"$f":"[1]Sheet1!R47","v":"2023-07-11"},{"$f":"IF(AJ161>0, IF(AJ161<H161, [1]Sheet1!Q47/L161/M161, 0),0)","v":0},{"$f":"IF(AJ161>0, IF(AJ161>=H161, [1]Sheet1!O47/L161/M161 -S161, 0),0)","v":-2.0766774090455253E-2},{"$f":" IF(AJ161>H161, [1]Sheet1!Q47/L161/M161, 0)","v":2.0766774090455253E-2},null,null,null,null,null,null,31017,1,1,0,0,0,9.4899999999999998E-2,1,44.733333333333334,0,8.3694444444444436,0,1,43.733333333333334]
[{"$f":"[1]Sheet1!A48","v":"Bullough, Rose C"},{"$f":"[1]Sheet1!B48","v":"8000085"},{"$f":"[1]Sheet1!C48","v":"f"},{"$f":"[1]Sheet1!D48","v":"1986-05-15"},{"$f":"[1]Sheet1!L48","v":"2013-03-19"},"2099-12-31",null,7,7,0.25,0.25,{"$f":"[1]Sheet1!K48","v":90896},{"$f":"[1]Sheet1!I48","v":0.6},0.6,{"$f":"[1]Sheet1!M48","v":"2013-09-22"},{"$f":"[1]Sheet1!R48","v":"2020-09-22"},{"$f":"IF(AJ162>0, IF(AJ162<H162, [1]Sheet1!Q48/L162/M162, 0),0)","v":0.11866727790944753},{"$f":"IF(AJ162>0, IF(AJ162>=H162, [1]Sheet1!O48/L162/M162 -S162, 0),0)","v":0},{"$f":" IF(AJ162>H162, [1]Sheet1!Q48/L162/M162, 0)","v":0},null,null,null,null,null,null,34246,1,1,0,0,0,9.4899999999999998E-2,1,30.627777777777776,6471.8285357142859,3.7833333333333332,0.11866727790944753,1,29.627777777777776]
[{"$f":"[1]Sheet1!A49","v":"Burns, Evan J"},{"$f":"[1]Sheet1!B49","v":"8000086"},{"$f":"[1]Sheet1!C49","v":"m"},{"$f":"[1]Sheet1!D49","v":"1969-09-16"},{"$f":"[1]Sheet1!L49","v":"2012-01-09"},"2099-12-31",null,7,7,0.25,0.25,{"$f":"[1]Sheet1!K49","v":87815},{"$f":"[1]Sheet1!I49","v":1},1,{"$f":"[1]Sheet1!M49","v":"2012-02-12"},{"$f":"[1]Sheet1!R49","v":"2019-02-12"},{"$f":"IF(AJ163>0, IF(AJ163<H163, [1]Sheet1!Q49/L163/M163, 0),0)","v":0.17503422653055112},{"$f":"IF(AJ163>0, IF(AJ163>=H163, [1]Sheet1!O49/L163/M163 -S163, 0),0)","v":0},{"$f":" IF(AJ163>H163, [1]Sheet1!Q49/L163/M163, 0)","v":0},null,null,null,null,null,null,33847,1,1,0,0,0,9.4899999999999998E-2,1,47.291666666666664,15370.630602780346,4.9777777777777779,0.17503422653055112,1,46.291666666666664]
[{"$f":"[1]Sheet1!A50","v":"Burton, Peter F"},{"$f":"[1]Sheet1!B50","v":"8000088"},{"$f":"[1]Sheet1!C50","v":"m"},{"$f":"[1]Sheet1!D50","v":"1958-05-31"},{"$f":"[1]Sheet1!L50","v":"2016-06-07"},"2099-12-31",null,7,7,0.25,0.25,{"$f":"[1]Sheet1!K50","v":75295},{"$f":"[1]Sheet1!I50","v":1},1,{"$f":"[1]Sheet1!M50","v":"2016-08-11"},{"$f":"[1]Sheet1!R50","v":"2023-08-11"},{"$f":"IF(AJ164>0, IF(AJ164<H164, [1]Sheet1!Q50/L164/M164, 0),0)","v":1.7800092442663142E-2},{"$f":"IF(AJ164>0, IF(AJ164>=H164, [1]Sheet1!O50/L164/M164 -S164, 0),0)","v":0},{"$f":" IF(AJ164>H164, [1]Sheet1!Q50/L164/M164, 0)","v":0},null,null,null,null,null,null,34248,1,1,0,0,0,9.4899999999999998E-2,1,58.583333333333336,1340.2579604703212,0.56666666666666665,1.7800092442663142E-2,0,0]
[{"$f":"[1]Sheet1!A51","v":"Butchart, Shane A"},{"$f":"[1]Sheet1!B51","v":"8000089"},{"$f":"[1]Sheet1!C51","v":"m"},{"$f":"[1]Sheet1!D51","v":"1970-08-11"},{"$f":"[1]Sheet1!L51","v":"2011-09-01"},"2099-12-31",null,7,7,0.25,0.25,{"$f":"[1]Sheet1!K51","v":98211},{"$f":"[1]Sheet1!I51","v":1},1,{"$f":"[1]Sheet1!M51","v":"2012-02-12"},{"$f":"[1]Sheet1!R51","v":"2019-02-12"},{"$f":"IF(AJ165>0, IF(AJ165<H165, [1]Sheet1!Q51/L165/M165, 0),0)","v":0.17503422653055112},{"$f":"IF(AJ165>0, IF(AJ165>=H165, [1]Sheet1!O51/L165/M165 -S165, 0),0)","v":0},{"$f":" IF(AJ165>H165, [1]Sheet1!Q51/L165/M165, 0)","v":0},null,null,null,null,null,null,35960,1,1,0,0,0,9.4899999999999998E-2,1,46.388888888888886,17190.286421791956,5.333333333333333,0.17503422653055112,1,45.388888888888886]
[{"$f":"[1]Sheet1!A52","v":"Byfield, Susan P"},{"$f":"[1]Sheet1!B52","v":"8000091"},{"$f":"[1]Sheet1!C52","v":"f"},{"$f":"[1]Sheet1!D52","v":"1953-02-18"},{"$f":"[1]Sheet1!L52","v":"1997-02-17"},"2099-12-31",null,7,7,0.25,0.25,{"$f":"[1]Sheet1!K52","v":111106},{"$f":"[1]Sheet1!I52","v":1},1,{"$f":"[1]Sheet1!M52","v":"2011-10-11"},{"$f":"[1]Sheet1!R52","v":"2018-10-11"},{"$f":"IF(AJ166>0, IF(AJ166<H166, [1]Sheet1!Q52/L166/M166, 0),0)","v":0},{"$f":"IF(AJ166>0, IF(AJ166>=H166, [1]Sheet1!O52/L166/M166 -S166, 0),0)","v":-0.16389776282071533},{"$f":" IF(AJ166>H166, [1]Sheet1!Q52/L166/M166, 0)","v":0.18690095732071535},null,null,null,null,null,null,20398,1,1,0,0,0,9.4899999999999998E-2,1,63.869444444444447,2555.7929281170022,19.872222222222224,2.3003194500000018E-2,1,62.869444444444447]
[{"$f":"[1]Sheet1!A53","v":"Byrne, Benjamin"},{"$f":"[1]Sheet1!B53","v":"8000092"},{"$f":"[1]Sheet1!C53","v":"m"},{"$f":"[1]Sheet1!D53","v":"1978-06-30"},{"$f":"[1]Sheet1!L53","v":"2011-10-10"},"2099-12-31",null,7,7,0.25,0.25,{"$f":"[1]Sheet1!K53","v":95709},{"$f":"[1]Sheet1!I53","v":1},1,{"$f":"[1]Sheet1!M53","v":"2013-05-31"},{"$f":"[1]Sheet1!R53","v":"2020-05-31"},{"$f":"IF(AJ167>0, IF(AJ167<H167, [1]Sheet1!Q53/L167/M167, 0),0)","v":0.12964399726456236},{"$f":"IF(AJ167>0, IF(AJ167>=H167, [1]Sheet1!O53/L167/M167 -S167, 0),0)","v":0},{"$f":" IF(AJ167>H167, [1]Sheet1!Q53/L167/M167, 0)","v":0},null,null,null,null,null,null,33847,1,1,0,0,0,9.4899999999999998E-2,1,38.5,12408.097334193999,5.2249999999999996,0.12964399726456236,1,37.5]
[{"$f":"[1]Sheet1!A54","v":"Campbell, Amanda K"},{"$f":"[1]Sheet1!B54","v":"8000095"},{"$f":"[1]Sheet1!C54","v":"f"},{"$f":"[1]Sheet1!D54","v":"1969-11-05"},{"$f":"[1]Sheet1!L54","v":"2009-03-03"},"2099-12-31",null,7,7,0.25,0.25,{"$f":"[1]Sheet1!K54","v":87815},{"$f":"[1]Sheet1!I54","v":0.5},0.5,{"$f":"[1]Sheet1!M54","v":"2012-08-17"},{"$f":"[1]Sheet1!R54","v":"2019-08-17"},{"$f":"IF(AJ168>0, IF(AJ168<H168, [1]Sheet1!Q54/L168/M168, 0),0)","v":0},{"$f":"IF(AJ168>0, IF(AJ168>=H168, [1]Sheet1!O54/L168/M168 -S168, 0),0)","v":-0.1572341360961034},{"$f":" IF(AJ168>H168, [1]Sheet1!Q54/L168/M168, 0)","v":0.1572341360961034},null,null,null,null,null,null,33847,1,1,0,0,0,9.4899999999999998E-2,1,47.155555555555559,0,7.8277777777777775,0,1,46.155555555555559]
[{"$f":"[1]Sheet1!A55","v":"Campbell, Garry M"},{"$f":"[1]Sheet1!B55","v":"8000096"},{"$f":"[1]Sheet1!C55","v":"m"},{"$f":"[1]Sheet1!D55","v":"1958-01-15"},{"$f":"[1]Sheet1!L55","v":"2014-07-01"},"2099-12-31",null,7,7,0.25,0.25,{"$f":"[1]Sheet1!K55","v":98211},{"$f":"[1]Sheet1!I55","v":1},1,{"$f":"[1]Sheet1!M55","v":"2014-12-31"},{"$f":"[1]Sheet1!R55","v":"2021-12-31"},{"$f":"IF(AJ169>0, IF(AJ169<H169, [1]Sheet1!Q55/L169/M169, 0),0)","v":7.416704740201388E-2},{"$f":"IF(AJ169>0, IF(AJ169>=H169, [1]Sheet1!O55/L169/M169 -S169, 0),0)","v":0},{"$f":" IF(AJ169>H169, [1]Sheet1!Q55/L169/M169, 0)","v":0},null,null,null,null,null,null,33847,1,1,0,0,0,9.4899999999999998E-2,1,58.961111111111109,7284.0198923991848,2.5,7.416704740201388E-2,1,57.961111111111109]
[{"$f":"[1]Sheet1!A56","v":"Carroll, Ashley P"},{"$f":"[1]Sheet1!B56","v":"8000098"},{"$f":"[1]Sheet1!C56","v":"m"},{"$f":"[1]Sheet1!D56","v":"1960-07-20"},{"$f":"[1]Sheet1!L56","v":"2008-01-14"},"2099-12-31",null,7,7,0.25,0.25,{"$f":"[1]Sheet1!K56","v":111106},{"$f":"[1]Sheet1!I56","v":1},1,{"$f":"[1]Sheet1!M56","v":"2015-03-03"},{"$f":"[1]Sheet1!R56","v":"2022-03-03"},{"$f":"IF(AJ170>0, IF(AJ170<H170, [1]Sheet1!Q56/L170/M170, 0),0)","v":0},{"$f":"IF(AJ170>0, IF(AJ170>=H170, [1]Sheet1!O56/L170/M170 -S170, 0),0)","v":0.18096758982613537},{"$f":" IF(AJ170>H170, [1]Sheet1!Q56/L170/M170, 0)","v":6.8233683923864641E-2},null,null,null,null,null,null,33847,1,1,0,0,0,9.4899999999999998E-2,1,56.447222222222223,27687.756721267502,8.9638888888888886,0.24920127375000001,1,55.447222222222223]
[{"$f":"[1]Sheet1!A57","v":"Carroll, Sacha K"},{"$f":"[1]Sheet1!B57","v":"8000099"},{"$f":"[1]Sheet1!C57","v":"f"},{"$f":"[1]Sheet1!D57","v":"1975-06-04"},{"$f":"[1]Sheet1!L57","v":"2011-01-10"},"2099-12-31",null,7,7,0.25,0.25,{"$f":"[1]Sheet1!K57","v":99345},{"$f":"[1]Sheet1!I57","v":0.8},0.8,{"$f":"[1]Sheet1!M57","v":"2016-07-11"},{"$f":"[1]Sheet1!R57","v":"2023-07-11"},{"$f":"IF(AJ171>0, IF(AJ171<H171, [1]Sheet1!Q57/L171/M171, 0),0)","v":2.0766772264804889E-2},{"$f":"IF(AJ171>0, IF(AJ171>=H171, [1]Sheet1!O57/L171/M171 -S171, 0),0)","v":0},{"$f":" IF(AJ171>H171, [1]Sheet1!Q57/L171/M171, 0)","v":0},null,null,null,null,null,null,33847,1,1,0,0,0,9.4899999999999998E-2,1,41.575000000000003,1650.4599925176333,5.9749999999999996,2.0766772264804889E-2,1,40.575000000000003]
[{"$f":"[1]Sheet1!A58","v":"Carruth, Daena V"},{"$f":"[1]Sheet1!B58","v":"8000100"},{"$f":"[1]Sheet1!C58","v":"f"},{"$f":"[1]Sheet1!D58","v":"1978-09-01"},{"$f":"[1]Sheet1!L58","v":"2012-04-10"},"2099-12-31",null,7,7,0.25,0.25,{"$f":"[1]Sheet1!K58","v":101943},{"$f":"[1]Sheet1!I58","v":1},1,{"$f":"[1]Sheet1!M58","v":"2012-05-16"},{"$f":"[1]Sheet1!R58","v":"2019-05-16"},{"$f":"IF(AJ172>0, IF(AJ172<H172, [1]Sheet1!Q58/L172/M172, 0),0)","v":0.16613418323026014},{"$f":"IF(AJ172>0, IF(AJ172>=H172, [1]Sheet1!O58/L172/M172 -S172, 0),0)","v":0},{"$f":" IF(AJ172>H172, [1]Sheet1!Q58/L172/M172, 0)","v":0},null,null,null,null,null,null,33847,1,1,0,0,0,9.4899999999999998E-2,1,38.333333333333336,16936.217041042408,4.7249999999999996,0.16613418323026014,1,37.333333333333336]
[{"$f":"[1]Sheet1!A59","v":"Chandler, Sandra A"},{"$f":"[1]Sheet1!B59","v":"8000103"},{"$f":"[1]Sheet1!C59","v":"f"},{"$f":"[1]Sheet1!D59","v":"1957-02-27"},{"$f":"[1]Sheet1!L59","v":"2015-02-16"},"2099-12-31",null,7,7,0.25,0.25,{"$f":"[1]Sheet1!K59","v":105816},{"$f":"[1]Sheet1!I59","v":1},1,{"$f":"[1]Sheet1!M59","v":"2010-01-16"},{"$f":"[1]Sheet1!R59","v":"2017-01-16"},{"$f":"IF(AJ173>0, IF(AJ173<H173, [1]Sheet1!Q59/L173/M173, 0),0)","v":0.24764399399535714},{"$f":"IF(AJ173>0, IF(AJ173>=H173, [1]Sheet1!O59/L173/M173 -S173, 0),0)","v":0},{"$f":" IF(AJ173>H173, [1]Sheet1!Q59/L173/M173, 0)","v":0},null,null,null,null,null,null,33847,1,1,0,0,0,9.4899999999999998E-2,1,59.844444444444441,26204.696868612711,1.875,0.24764399399535714,1,58.844444444444441]
[{"$f":"[1]Sheet1!A60","v":"Chetcuti, John"},{"$f":"[1]Sheet1!B60","v":"8000104"},{"$f":"[1]Sheet1!C60","v":"m"},{"$f":"[1]Sheet1!D60","v":"1952-05-23"},{"$f":"[1]Sheet1!L60","v":"2008-03-04"},"2099-12-31",null,7,7,0.25,0.25,{"$f":"[1]Sheet1!K60","v":64256},{"$f":"[1]Sheet1!I60","v":1},1,{"$f":"[1]Sheet1!M60","v":"2015-06-03"},{"$f":"[1]Sheet1!R60","v":"2022-06-03"},{"$f":"IF(AJ174>0, IF(AJ174<H174, [1]Sheet1!Q60/L174/M174, 0),0)","v":0},{"$f":"IF(AJ174>0, IF(AJ174>=H174, [1]Sheet1!O60/L174/M174 -S174, 0),0)","v":8.2519398428348462E-2},{"$f":" IF(AJ174>H174, [1]Sheet1!Q60/L174/M174, 0)","v":5.933363856430595E-2},null,null,null,null,null,null,33847,1,1,0,0,0,9.4899999999999998E-2,1,64.605555555555554,9114.9087450000025,8.8249999999999993,0.14185303699265442,1,63.605555555555554]
[{"$f":"[1]Sheet1!A61","v":"Chiffings, Peter"},{"$f":"[1]Sheet1!B61","v":"8000105"},{"$f":"[1]Sheet1!C61","v":"m"},{"$f":"[1]Sheet1!D61","v":"1949-12-18"},{"$f":"[1]Sheet1!L61","v":"2000-06-12"},"2099-12-31",null,7,7,0.25,0.25,{"$f":"[1]Sheet1!K61","v":124033},{"$f":"[1]Sheet1!I61","v":1},1,{"$f":"[1]Sheet1!M61","v":"2014-11-30"},{"$f":"[1]Sheet1!R61","v":"2021-11-30"},{"$f":"IF(AJ175>0, IF(AJ175<H175, [1]Sheet1!Q61/L175/M175, 0),0)","v":0},{"$f":"IF(AJ175>0, IF(AJ175>=H175, [1]Sheet1!O61/L175/M175 -S175, 0),0)","v":9.1556368072859926E-2},{"$f":" IF(AJ175>H175, [1]Sheet1!Q61/L175/M175, 0)","v":7.7133729159328271E-2},null,null,null,null,null,null,33847,1,1,0,0,0,9.4899999999999998E-2,1,67.036111111111111,20923.13883,16.552777777777777,0.1686900972321882,1,66.036111111111111]
[{"$f":"[1]Sheet1!A62","v":"Chileshe, Wendy"},{"$f":"[1]Sheet1!B62","v":"8000106"},{"$f":"[1]Sheet1!C62","v":"f"},{"$f":"[1]Sheet1!D62","v":"1973-01-19"},{"$f":"[1]Sheet1!L62","v":"2013-08-29"},"2099-12-31",null,7,7,0.25,0.25,{"$f":"[1]Sheet1!K62","v":87815},{"$f":"[1]Sheet1!I62","v":0.5},0.5,{"$f":"[1]Sheet1!M62","v":"2014-04-27"},{"$f":"[1]Sheet1!R62","v":"2021-04-27"},{"$f":"IF(AJ176>0, IF(AJ176<H176, [1]Sheet1!Q62/L176/M176, 0),0)","v":9.790050131461088E-2},{"$f":"IF(AJ176>0, IF(AJ176>=H176, [1]Sheet1!O62/L176/M176 -S176, 0),0)","v":0},{"$f":" IF(AJ176>H176, [1]Sheet1!Q62/L176/M176, 0)","v":0},null,null,null,null,null,null,33847,1,1,0,0,0,9.4899999999999998E-2,1,43.95,4298.5662614712774,3.338888888888889,9.790050131461088E-2,1,42.95]
[{"$f":"[1]Sheet1!A63","v":"Chitate, Hammond"},{"$f":"[1]Sheet1!B63","v":"8000107"},{"$f":"[1]Sheet1!C63","v":"m"},{"$f":"[1]Sheet1!D63","v":"1973-06-09"},{"$f":"[1]Sheet1!L63","v":"2012-09-19"},"2099-12-31",null,7,7,0.25,0.25,{"$f":"[1]Sheet1!K63","v":98211},{"$f":"[1]Sheet1!I63","v":1},1,{"$f":"[1]Sheet1!M63","v":"2012-10-18"},{"$f":"[1]Sheet1!R63","v":"2019-10-18"},{"$f":"IF(AJ177>0, IF(AJ177<H177, [1]Sheet1!Q63/L177/M177, 0),0)","v":0.15130077261795416},{"$f":"IF(AJ177>0, IF(AJ177>=H177, [1]Sheet1!O63/L177/M177 -S177, 0),0)","v":0},{"$f":" IF(AJ177>H177, [1]Sheet1!Q63/L177/M177, 0)","v":0},null,null,null,null,null,null,33847,1,1,0,0,0,9.4899999999999998E-2,1,43.56111111111111,14859.400179581897,4.2833333333333332,0.15130077261795416,1,42.56111111111111]
[{"$f":"[1]Sheet1!A64","v":"Clarke, Sandra R"},{"$f":"[1]Sheet1!B64","v":"8000109"},{"$f":"[1]Sheet1!C64","v":"f"},{"$f":"[1]Sheet1!D64","v":"1974-05-01"},{"$f":"[1]Sheet1!L64","v":"1998-09-14"},"2099-12-31",null,7,7,0.25,0.25,{"$f":"[1]Sheet1!K64","v":47116.93},{"$f":"[1]Sheet1!I64","v":0.5},0.5,{"$f":"[1]Sheet1!M64","v":"2010-06-03"},{"$f":"[1]Sheet1!R64","v":"2017-06-03"},{"$f":"IF(AJ178>0, IF(AJ178<H178, [1]Sheet1!Q64/L178/M178, 0),0)","v":0},{"$f":"IF(AJ178>0, IF(AJ178>=H178, [1]Sheet1!O64/L178/M178 -S178, 0),0)","v":-0.23436788516247919},{"$f":" IF(AJ178>H178, [1]Sheet1!Q64/L178/M178, 0)","v":0.23436788516247919},null,null,null,null,null,null,33847,1,1,0,0,0,9.4899999999999998E-2,1,42.666666666666664,0,18.297222222222221,0,1,41.666666666666664]
[{"$f":"[1]Sheet1!A65","v":"Clune, Katie M"},{"$f":"[1]Sheet1!B65","v":"8000111"},{"$f":"[1]Sheet1!C65","v":"f"},{"$f":"[1]Sheet1!D65","v":"1983-01-27"},{"$f":"[1]Sheet1!L65","v":"2012-01-09"},"2099-12-31",null,7,7,0.25,0.25,{"$f":"[1]Sheet1!K65","v":99345},{"$f":"[1]Sheet1!I65","v":0.3},0.3,{"$f":"[1]Sheet1!M65","v":"2012-03-15"},{"$f":"[1]Sheet1!R65","v":"2019-03-15"},{"$f":"IF(AJ179>0, IF(AJ179<H179, [1]Sheet1!Q65/L179/M179, 0),0)","v":0.17206754670840937},{"$f":"IF(AJ179>0, IF(AJ179>=H179, [1]Sheet1!O65/L179/M179 -S179, 0),0)","v":0},{"$f":" IF(AJ179>H179, [1]Sheet1!Q65/L179/M179, 0)","v":0},null,null,null,null,null,null,33847,1,1,0,0,0,9.4899999999999998E-2,1,33.927777777777777,5128.2151283240792,4.9777777777777779,0.17206754670840937,1,32.927777777777777]
[{"$f":"[1]Sheet1!A66","v":"Clune, Raymond W"},{"$f":"[1]Sheet1!B66","v":"8000112"},{"$f":"[1]Sheet1!C66","v":"m"},{"$f":"[1]Sheet1!D66","v":"1954-12-25"},{"$f":"[1]Sheet1!L66","v":"2016-07-01"},"2099-12-31",null,7,7,0.25,0.25,{"$f":"[1]Sheet1!K66","v":64256},{"$f":"[1]Sheet1!I66","v":1},1,{"$f":"[1]Sheet1!M66","v":"2015-07-04"},{"$f":"[1]Sheet1!R66","v":"2022-07-04"},{"$f":"IF(AJ180>0, IF(AJ180<H180, [1]Sheet1!Q66/L180/M180, 0),0)","v":5.6366954819568479E-2},{"$f":"IF(AJ180>0, IF(AJ180>=H180, [1]Sheet1!O66/L180/M180 -S180, 0),0)","v":0},{"$f":" IF(AJ180>H180, [1]Sheet1!Q66/L180/M180, 0)","v":0},null,null,null,null,null,null,33847,1,1,0,0,0,9.4899999999999998E-2,1,{"$f":"AG180*YEARFRAC($D180,ValDate)","v":62.016666666666666},{"$f":"L180*M180*SUM(Q180:S180)","v":3621.9150488861924},{"$f":"AG180*YEARFRAC(E180,VaDate)","v":0.5},{"$f":"AG180*SUM(Q180:S180)","v":5.6366954819568479E-2},0,{"$f":"AL180*YEARFRAC($D180,LastYear)","v":0}]
[{"$f":"[1]Sheet1!A67","v":"Cohen, Brian"},{"$f":"[1]Sheet1!B67","v":"8000114"},{"$f":"[1]Sheet1!C67","v":"m"},{"$f":"[1]Sheet1!D67","v":"1965-02-22"},{"$f":"[1]Sheet1!L67","v":"2007-07-23"},"2099-12-31",null,7,7,0.25,0.25,{"$f":"[1]Sheet1!K67","v":103122},{"$f":"[1]Sheet1!I67","v":1},{"$f":"M181","v":1},{"$f":"[1]Sheet1!M67","v":"2014-08-29"},{"$f":"[1]Sheet1!R67","v":"2021-08-29"},{"$f":"IF(AJ181>0, IF(AJ181<H181, [1]Sheet1!Q67/L181/M181, 0),0)","v":0},{"$f":"IF(AJ181>0, IF(AJ181>=H181, [1]Sheet1!O67/L181/M181 -S181, 0),0)","v":0.1516659021416876},{"$f":" IF(AJ181>H181, [1]Sheet1!Q67/L181/M181, 0)","v":8.6033774358312415E-2},null,null,null,null,null,null,33847,1,1,0,0,0,9.4899999999999998E-2,1,51.858333333333334,24512.066040033002,9.4388888888888882,0.23769967650000001,1,50.858333333333334]
[{"$f":"[1]Sheet1!A68","v":"Cohen, David I"},{"$f":"[1]Sheet1!B68","v":"8000115"},{"$f":"[1]Sheet1!C68","v":"m"},{"$f":"[1]Sheet1!D68","v":"1960-11-20"},{"$f":"[1]Sheet1!L68","v":"1998-06-29"},"2099-12-31",null,7,7,0.25,0.25,{"$f":"[1]Sheet1!K68","v":142609},{"$f":"[1]Sheet1!I68","v":1},1,{"$f":"[1]Sheet1!M68","v":"2014-01-05"},{"$f":"[1]Sheet1!R68","v":"2021-01-05"},{"$f":"IF(AJ182>0, IF(AJ182<H182, [1]Sheet1!Q68/L182/M182, 0),0)","v":0},{"$f":"IF(AJ182>0, IF(AJ182>=H182, [1]Sheet1!O68/L182/M182 -S182, 0),0)","v":0.14058161717699938},{"$f":" IF(AJ182>H182, [1]Sheet1!Q68/L182/M182, 0)","v":0.10861927968520776},null,null,null,null,null,null,33847,1,1,0,0,0,9.4899999999999998E-2,1,56.113888888888887,35538.2907006225,18.505555555555556,0.24920089686220714,1,55.113888888888887]
[{"$f":"[1]Sheet1!A69","v":"Collard, Charles R"},{"$f":"[1]Sheet1!B69","v":"8000116"},{"$f":"[1]Sheet1!C69","v":"m"},{"$f":"[1]Sheet1!D69","v":"1964-08-11"},{"$f":"[1]Sheet1!L69","v":"2006-01-16"},"2099-12-31",null,7,7,0.25,0.25,{"$f":"[1]Sheet1!K69","v":80797},{"$f":"[1]Sheet1!I69","v":1},1,{"$f":"[1]Sheet1!M69","v":"2013-05-22"},{"$f":"[1]Sheet1!R69","v":"2020-05-22"},{"$f":"IF(AJ183>0, IF(AJ183<H183, [1]Sheet1!Q69/L183/M183, 0),0)","v":0},{"$f":"IF(AJ183>0, IF(AJ183>=H183, [1]Sheet1!O69/L183/M183 -S183, 0),0)","v":-0.13053400509928681},{"$f":" IF(AJ183>H183, [1]Sheet1!Q69/L183/M183, 0)","v":0.13053400509928681},null,null,null,null,null,null,33847,1,1,0,0,0,9.4899999999999998E-2,1,52.388888888888886,0,10.958333333333334,0,1,51.388888888888886]
[{"$f":"[1]Sheet1!A70","v":"Cook, Emma J"},{"$f":"[1]Sheet1!B70","v":"8000118"},{"$f":"[1]Sheet1!C70","v":"f"},{"$f":"[1]Sheet1!D70","v":"1975-10-21"},{"$f":"[1]Sheet1!L70","v":"2013-06-07"},"2099-12-31",null,7,7,0.25,0.25,{"$f":"[1]Sheet1!K70","v":98211},{"$f":"[1]Sheet1!I70","v":1},1,{"$f":"[1]Sheet1!M70","v":"2015-10-05"},{"$f":"[1]Sheet1!R70","v":"2022-10-05"},{"$f":"IF(AJ184>0, IF(AJ184<H184, [1]Sheet1!Q70/L184/M184, 0),0)","v":4.7466909833409399E-2},{"$f":"IF(AJ184>0, IF(AJ184>=H184, [1]Sheet1!O70/L184/M184 -S184, 0),0)","v":0},{"$f":" IF(AJ184>H184, [1]Sheet1!Q70/L184/M184, 0)","v":0},null,null,null,null,null,null,33847,1,1,0,0,0,9.4899999999999998E-2,1,41.194444444444443,4661.7726816489703,3.5666666666666669,4.7466909833409399E-2,1,40.194444444444443]
[{"$f":"[1]Sheet1!A71","v":"Cook, Leah J"},{"$f":"[1]Sheet1!B71","v":"8000119"},{"$f":"[1]Sheet1!C71","v":"f"},{"$f":"[1]Sheet1!D71","v":"1969-12-15"},{"$f":"[1]Sheet1!L71","v":"2011-01-01"},"2099-12-31",null,7,7,0.25,0.25,{"$f":"[1]Sheet1!K71","v":101943},{"$f":"[1]Sheet1!I71","v":1},1,{"$f":"[1]Sheet1!M71","v":"2011-01-06"},{"$f":"[1]Sheet1!R71","v":"2018-01-06"},{"$f":"IF(AJ185>0, IF(AJ185<H185, [1]Sheet1!Q71/L185/M185, 0),0)","v":0},{"$f":"IF(AJ185>0, IF(AJ185>=H185, [1]Sheet1!O71/L185/M185 -S185, 0),0)","v":0},{"$f":" IF(AJ185>H185, [1]Sheet1!Q71/L185/M185, 0)","v":0},null,null,null,null,null,null,33847,1,1,0,0,0,9.4899999999999998E-2]
[{"$f":"[1]Sheet1!A72","v":"Cooper, Kristy L"},{"$f":"[1]Sheet1!B72","v":"8000123"},{"$f":"[1]Sheet1!C72","v":"f"},{"$f":"[1]Sheet1!D72","v":"1980-09-10"},{"$f":"[1]Sheet1!L72","v":"1998-01-20"},"2099-12-31",null,7,7,0.25,0.25,{"$f":"[1]Sheet1!K72","v":73717},{"$f":"[1]Sheet1!I72","v":1},1,{"$f":"[1]Sheet1!M72","v":"2012-10-18"},{"$f":"[1]Sheet1!R72","v":"2019-10-18"},{"$f":"IF(AJ186>0, IF(AJ186<H186, [1]Sheet1!Q72/L186/M186, 0),0)","v":0},{"$f":"IF(AJ186>0, IF(AJ186>=H186, [1]Sheet1!O72/L186/M186 -S186, 0),0)","v":0},{"$f":" IF(AJ186>H186, [1]Sheet1!Q72/L186/M186, 0)","v":0},null,null,null,null,null,null,33847,1,1,0,0,0,9.4899999999999998E-2]
[{"$f":"[1]Sheet1!A73","v":"Cooper, Stephen P"},{"$f":"[1]Sheet1!B73","v":"8000124"},{"$f":"[1]Sheet1!C73","v":"m"},{"$f":"[1]Sheet1!D73","v":"1958-05-31"},{"$f":"[1]Sheet1!L73","v":"1996-01-08"},"2099-12-31",null,7,7,0.25,0.25,{"$f":"[1]Sheet1!K73","v":142609},{"$f":"[1]Sheet1!I73","v":1},1,{"$f":"[1]Sheet1!M73","v":"2012-06-16"},{"$f":"[1]Sheet1!R73","v":"2019-06-16"},{"$f":"IF(AJ187>0, IF(AJ187<H187, [1]Sheet1!Q73/L187/M187, 0),0)","v":0},{"$f":"IF(AJ187>0, IF(AJ187>=H187, [1]Sheet1!O73/L187/M187 -S187, 0),0)","v":0},{"$f":" IF(AJ187>H187, [1]Sheet1!Q73/L187/M187, 0)","v":0},null,null,null,null,null,null,33847,1,1,0,0,0,9.4899999999999998E-2]
[{"$f":"[1]Sheet1!A74","v":"Copley, Tanya L"},{"$f":"[1]Sheet1!B74","v":"8000125"},{"$f":"[1]Sheet1!C74","v":"f"},{"$f":"[1]Sheet1!D74","v":"1969-10-28"},{"$f":"[1]Sheet1!L74","v":"2002-01-14"},"2099-12-31",null,7,7,0.25,0.25,{"$f":"[1]Sheet1!K74","v":111106},{"$f":"[1]Sheet1!I74","v":1},1,{"$f":"[1]Sheet1!M74","v":"2015-02-26"},{"$f":"[1]Sheet1!R74","v":"2022-02-26"},{"$f":"IF(AJ188>0, IF(AJ188<H188, [1]Sheet1!Q74/L188/M188, 0),0)","v":0},{"$f":"IF(AJ188>0, IF(AJ188>=H188, [1]Sheet1!O74/L188/M188 -S188, 0),0)","v":0},{"$f":" IF(AJ188>H188, [1]Sheet1!Q74/L188/M188, 0)","v":0},null,null,null,null,null,null,33847,1,1,0,0,0,9.4899999999999998E-2]
[{"$f":"[1]Sheet1!A75","v":"Corkhill, Damian"},{"$f":"[1]Sheet1!B75","v":"8000126"},{"$f":"[1]Sheet1!C75","v":"m"},{"$f":"[1]Sheet1!D75","v":"1969-01-28"},{"$f":"[1]Sheet1!L75","v":"2014-02-03"},"2099-12-31",null,7,7,0.25,0.25,{"$f":"[1]Sheet1!K75","v":98211},{"$f":"[1]Sheet1!I75","v":1},1,{"$f":"[1]Sheet1!M75","v":"2014-03-27"},{"$f":"[1]Sheet1!R75","v":"2021-03-27"},{"$f":"IF(AJ189>0, IF(AJ189<H189, [1]Sheet1!Q75/L189/M189, 0),0)","v":0},{"$f":"IF(AJ189>0, IF(AJ189>=H189, [1]Sheet1!O75/L189/M189 -S189, 0),0)","v":0},{"$f":" IF(AJ189>H189, [1]Sheet1!Q75/L189/M189, 0)","v":0},null,null,null,null,null,null,33847,1,1,0,0,0,9.4899999999999998E-2]
[{"$f":"[1]Sheet1!A76","v":"Courtney, Samantha E"},{"$f":"[1]Sheet1!B76","v":"8000129"},{"$f":"[1]Sheet1!C76","v":"f"},{"$f":"[1]Sheet1!D76","v":"1986-05-24"},{"$f":"[1]Sheet1!L76","v":"2014-04-28"},"2099-12-31",null,7,7,0.25,0.25,{"$f":"[1]Sheet1!K76","v":62482},{"$f":"[1]Sheet1!I76","v":1},1,{"$f":"[1]Sheet1!M76","v":"2014-05-28"},{"$f":"[1]Sheet1!R76","v":"2021-05-28"},{"$f":"IF(AJ190>0, IF(AJ190<H190, [1]Sheet1!Q76/L190/M190, 0),0)","v":0},{"$f":"IF(AJ190>0, IF(AJ190>=H190, [1]Sheet1!O76/L190/M190 -S190, 0),0)","v":0},{"$f":" IF(AJ190>H190, [1]Sheet1!Q76/L190/M190, 0)","v":0},null,null,null,null,null,null,33847,1,1,0,0,0,9.4899999999999998E-2]
[{"$f":"[1]Sheet1!A77","v":"Crafter, Belinda J"},{"$f":"[1]Sheet1!B77","v":"8000131"},{"$f":"[1]Sheet1!C77","v":"f"},{"$f":"[1]Sheet1!D77","v":"1965-06-14"},{"$f":"[1]Sheet1!L77","v":"2001-11-13"},"2099-12-31",null,7,7,0.25,0.25,{"$f":"[1]Sheet1!K77","v":109590},{"$f":"[1]Sheet1!I77","v":1},1,{"$f":"[1]Sheet1!M77","v":"2016-06-10"},{"$f":"[1]Sheet1!R77","v":"2023-06-10"},{"$f":"IF(AJ191>0, IF(AJ191<H191, [1]Sheet1!Q77/L191/M191, 0),0)","v":0},{"$f":"IF(AJ191>0, IF(AJ191>=H191, [1]Sheet1!O77/L191/M191 -S191, 0),0)","v":0},{"$f":" IF(AJ191>H191, [1]Sheet1!Q77/L191/M191, 0)","v":0},null,null,null,null,null,null,33847,1,1,0,0,0,9.4899999999999998E-2]
[{"$f":"[1]Sheet1!A78","v":"Cruickshank, Serena M"},{"$f":"[1]Sheet1!B78","v":"8000134"},{"$f":"[1]Sheet1!C78","v":"f"},{"$f":"[1]Sheet1!D78","v":"1970-09-01"},{"$f":"[1]Sheet1!L78","v":"1999-05-31"},"2099-12-31",null,7,7,0.25,0.25,{"$f":"[1]Sheet1!K78","v":124033},{"$f":"[1]Sheet1!I78","v":1},1,{"$f":"[1]Sheet1!M78","v":"2015-07-04"},{"$f":"[1]Sheet1!R78","v":"2022-07-04"},{"$f":"IF(AJ192>0, IF(AJ192<H192, [1]Sheet1!Q78/L192/M192, 0),0)","v":0},{"$f":"IF(AJ192>0, IF(AJ192>=H192, [1]Sheet1!O78/L192/M192 -S192, 0),0)","v":0},{"$f":" IF(AJ192>H192, [1]Sheet1!Q78/L192/M192, 0)","v":0},null,null,null,null,null,null,33847,1,1,0,0,0,9.4899999999999998E-2]
[{"$f":"[1]Sheet1!A79","v":"Curley, Larissa M D"},{"$f":"[1]Sheet1!B79","v":"8000138"},{"$f":"[1]Sheet1!C79","v":"f"},{"$f":"[1]Sheet1!D79","v":"1975-06-24"},{"$f":"[1]Sheet1!L79","v":"2005-08-15"},"2099-12-31",null,7,7,0.25,0.25,{"$f":"[1]Sheet1!K79","v":73717},{"$f":"[1]Sheet1!I79","v":0.8},0.8,{"$f":"[1]Sheet1!M79","v":"2014-07-29"},{"$f":"[1]Sheet1!R79","v":"2021-07-29"},{"$f":"IF(AJ193>0, IF(AJ193<H193, [1]Sheet1!Q79/L193/M193, 0),0)","v":0},{"$f":"IF(AJ193>0, IF(AJ193>=H193, [1]Sheet1!O79/L193/M193 -S193, 0),0)","v":0},{"$f":" IF(AJ193>H193, [1]Sheet1!Q79/L193/M193, 0)","v":0},null,null,null,null,null,null,33847,1,1,0,0,0,9.4899999999999998E-2]
[{"$f":"[1]Sheet1!A80","v":"Currie, Elaine M"},{"$f":"[1]Sheet1!B80","v":"8000139"},{"$f":"[1]Sheet1!C80","v":"f"},{"$f":"[1]Sheet1!D80","v":"1944-01-12"},{"$f":"[1]Sheet1!L80","v":"2011-03-16"},"2099-12-31",null,7,7,0.25,0.25,{"$f":"[1]Sheet1!K80","v":101943},{"$f":"[1]Sheet1!I80","v":1},1,{"$f":"[1]Sheet1!M80","v":"2012-12-31"},{"$f":"[1]Sheet1!R80","v":"2019-12-31"},{"$f":"IF(AJ194>0, IF(AJ194<H194, [1]Sheet1!Q80/L194/M194, 0),0)","v":0},{"$f":"IF(AJ194>0, IF(AJ194>=H194, [1]Sheet1!O80/L194/M194 -S194, 0),0)","v":0},{"$f":" IF(AJ194>H194, [1]Sheet1!Q80/L194/M194, 0)","v":0},null,null,null,null,null,null,33847,1,1,0,0,0,9.4899999999999998E-2]
[{"$f":"[1]Sheet1!A81","v":"Daintith, Michael"},{"$f":"[1]Sheet1!B81","v":"8000140"},{"$f":"[1]Sheet1!C81","v":"m"},{"$f":"[1]Sheet1!D81","v":"1972-02-18"},{"$f":"[1]Sheet1!L81","v":"2011-07-08"},"2099-12-31",null,7,7,0.25,0.25,{"$f":"[1]Sheet1!K81","v":98211},{"$f":"[1]Sheet1!I81","v":1},1,{"$f":"[1]Sheet1!M81","v":"2011-08-11"},{"$f":"[1]Sheet1!R81","v":"2018-08-11"},{"$f":"IF(AJ195>0, IF(AJ195<H195, [1]Sheet1!Q81/L195/M195, 0),0)","v":0},{"$f":"IF(AJ195>0, IF(AJ195>=H195, [1]Sheet1!O81/L195/M195 -S195, 0),0)","v":0},{"$f":" IF(AJ195>H195, [1]Sheet1!Q81/L195/M195, 0)","v":0},null,null,null,null,null,null,33847,1,1,0,0,0,9.4899999999999998E-2]
[{"$f":"[1]Sheet1!A82","v":"Dalgety, Shanarla"},{"$f":"[1]Sheet1!B82","v":"8000141"},{"$f":"[1]Sheet1!C82","v":"f"},{"$f":"[1]Sheet1!D82","v":"1984-10-06"},{"$f":"[1]Sheet1!L82","v":"2015-04-01"},"2099-12-31",null,7,7,0.25,0.25,{"$f":"[1]Sheet1!K82","v":78593},{"$f":"[1]Sheet1!I82","v":1},1,{"$f":"[1]Sheet1!M82","v":"2016-01-09"},{"$f":"[1]Sheet1!R82","v":"2023-01-09"},{"$f":"IF(AJ196>0, IF(AJ196<H196, [1]Sheet1!Q82/L196/M196, 0),0)","v":0},{"$f":"IF(AJ196>0, IF(AJ196>=H196, [1]Sheet1!O82/L196/M196 -S196, 0),0)","v":0},{"$f":" IF(AJ196>H196, [1]Sheet1!Q82/L196/M196, 0)","v":0},null,null,null,null,null,null,33847,1,1,0,0,0,9.4899999999999998E-2]
[{"$f":"[1]Sheet1!A83","v":"Dalton, Lara"},{"$f":"[1]Sheet1!B83","v":"8000142"},{"$f":"[1]Sheet1!C83","v":"f"},{"$f":"[1]Sheet1!D83","v":"1970-05-23"},{"$f":"[1]Sheet1!L83","v":"2014-10-01"},"2099-12-31",null,7,7,0.25,0.25,{"$f":"[1]Sheet1!K83","v":84599},{"$f":"[1]Sheet1!I83","v":1},1,{"$f":"[1]Sheet1!M83","v":"2015-01-31"},{"$f":"[1]Sheet1!R83","v":"2022-01-31"},{"$f":"IF(AJ197>0, IF(AJ197<H197, [1]Sheet1!Q83/L197/M197, 0),0)","v":0},{"$f":"IF(AJ197>0, IF(AJ197>=H197, [1]Sheet1!O83/L197/M197 -S197, 0),0)","v":0},{"$f":" IF(AJ197>H197, [1]Sheet1!Q83/L197/M197, 0)","v":0},null,null,null,null,null,null,33847,1,1,0,0,0,9.4899999999999998E-2]
[{"$f":"[1]Sheet1!A84","v":"Daniels, Gregory P"},{"$f":"[1]Sheet1!B84","v":"8000144"},{"$f":"[1]Sheet1!C84","v":"m"},{"$f":"[1]Sheet1!D84","v":"1953-07-09"},{"$f":"[1]Sheet1!L84","v":"2011-11-23"},"2099-12-31",null,7,7,0.25,0.25,{"$f":"[1]Sheet1!K84","v":64256},{"$f":"[1]Sheet1!I84","v":1},1,{"$f":"[1]Sheet1!M84","v":"2011-12-12"},{"$f":"[1]Sheet1!R84","v":"2018-12-12"},{"$f":"IF(AJ198>0, IF(AJ198<H198, [1]Sheet1!Q84/L198/M198, 0),0)","v":0},{"$f":"IF(AJ198>0, IF(AJ198>=H198, [1]Sheet1!O84/L198/M198 -S198, 0),0)","v":0},{"$f":" IF(AJ198>H198, [1]Sheet1!Q84/L198/M198, 0)","v":0},null,null,null,null,null,null,33847,1,1,0,0,0,9.4899999999999998E-2]
[{"$f":"[1]Sheet1!A85","v":"Darby, Stephen H"},{"$f":"[1]Sheet1!B85","v":"8000146"},{"$f":"[1]Sheet1!C85","v":"m"},{"$f":"[1]Sheet1!D85","v":"1965-11-23"},{"$f":"[1]Sheet1!L85","v":"2008-02-23"},"2099-12-31",null,7,7,0.25,0.25,{"$f":"[1]Sheet1!K85","v":98211},{"$f":"[1]Sheet1!I85","v":1},1,{"$f":"[1]Sheet1!M85","v":"2014-12-28"},{"$f":"[1]Sheet1!R85","v":"2021-12-28"},{"$f":"IF(AJ199>0, IF(AJ199<H199, [1]Sheet1!Q85/L199/M199, 0),0)","v":0},{"$f":"IF(AJ199>0, IF(AJ199>=H199, [1]Sheet1!O85/L199/M199 -S199, 0),0)","v":0},{"$f":" IF(AJ199>H199, [1]Sheet1!Q85/L199/M199, 0)","v":0},null,null,null,null,null,null,33847,1,1,0,0,0,9.4899999999999998E-2]
[{"$f":"[1]Sheet1!A86","v":"Darcy, William R"},{"$f":"[1]Sheet1!B86","v":"8000147"},{"$f":"[1]Sheet1!C86","v":"m"},{"$f":"[1]Sheet1!D86","v":"1956-05-20"},{"$f":"[1]Sheet1!L86","v":"2014-10-01"},"2099-12-31",null,7,7,0.25,0.25,{"$f":"[1]Sheet1!K86","v":94614},{"$f":"[1]Sheet1!I86","v":1},1,{"$f":"[1]Sheet1!M86","v":"2015-11-05"},{"$f":"[1]Sheet1!R86","v":"2022-11-05"},{"$f":"IF(AJ200>0, IF(AJ200<H200, [1]Sheet1!Q86/L200/M200, 0),0)","v":0},{"$f":"IF(AJ200>0, IF(AJ200>=H200, [1]Sheet1!O86/L200/M200 -S200, 0),0)","v":0},{"$f":" IF(AJ200>H200, [1]Sheet1!Q86/L200/M200, 0)","v":0},null,null,null,null,null,null,33847,1,1,0,0,0,9.4899999999999998E-2]
[{"$f":"[1]Sheet1!A87","v":"Daulby, Vicki"},{"$f":"[1]Sheet1!B87","v":"8000148"},{"$f":"[1]Sheet1!C87","v":"f"},{"$f":"[1]Sheet1!D87","v":"1956-08-07"},{"$f":"[1]Sheet1!L87","v":"2009-07-20"},"2099-12-31",null,7,7,0.25,0.25,{"$f":"[1]Sheet1!K87","v":57376},{"$f":"[1]Sheet1!I87","v":1},1,{"$f":"[1]Sheet1!M87","v":"2010-01-30"},{"$f":"[1]Sheet1!R87","v":"2017-01-30"},{"$f":"IF(AJ201>0, IF(AJ201<H201, [1]Sheet1!Q87/L201/M201, 0),0)","v":0},{"$f":"IF(AJ201>0, IF(AJ201>=H201, [1]Sheet1!O87/L201/M201 -S201, 0),0)","v":0},{"$f":" IF(AJ201>H201, [1]Sheet1!Q87/L201/M201, 0)","v":0},null,null,null,null,null,null,33847,1,1,0,0,0,9.4899999999999998E-2]
[{"$f":"[1]Sheet1!A88","v":"Davis, Deborah"},{"$f":"[1]Sheet1!B88","v":"8000149"},{"$f":"[1]Sheet1!C88","v":"f"},{"$f":"[1]Sheet1!D88","v":"1971-04-17"},{"$f":"[1]Sheet1!L88","v":"2015-07-01"},"2099-12-31",null,7,7,0.25,0.25,{"$f":"[1]Sheet1!K88","v":59172},{"$f":"[1]Sheet1!I88","v":1},1,{"$f":"[1]Sheet1!M88","v":"2016-09-11"},{"$f":"[1]Sheet1!R88","v":"2023-09-11"},{"$f":"IF(AJ202>0, IF(AJ202<H202, [1]Sheet1!Q88/L202/M202, 0),0)","v":0},{"$f":"IF(AJ202>0, IF(AJ202>=H202, [1]Sheet1!O88/L202/M202 -S202, 0),0)","v":0},{"$f":" IF(AJ202>H202, [1]Sheet1!Q88/L202/M202, 0)","v":0},null,null,null,null,null,null,33847,1,1,0,0,0,9.4899999999999998E-2]
[{"$f":"[1]Sheet1!A89","v":"De Kalbermatten, Muriel G"},{"$f":"[1]Sheet1!B89","v":"8000150"},{"$f":"[1]Sheet1!C89","v":"f"},{"$f":"[1]Sheet1!D89","v":"1973-10-23"},{"$f":"[1]Sheet1!L89","v":"2014-02-12"},"2099-12-31",null,7,7,0.25,0.25,{"$f":"[1]Sheet1!K89","v":46349},{"$f":"[1]Sheet1!I89","v":0.6},0.6,{"$f":"[1]Sheet1!M89","v":"2016-09-11"},{"$f":"[1]Sheet1!R89","v":"2023-09-11"},{"$f":"IF(AJ203>0, IF(AJ203<H203, [1]Sheet1!Q89/L203/M203, 0),0)","v":0},{"$f":"IF(AJ203>0, IF(AJ203>=H203, [1]Sheet1!O89/L203/M203 -S203, 0),0)","v":0},{"$f":" IF(AJ203>H203, [1]Sheet1!Q89/L203/M203, 0)","v":0},null,null,null,null,null,null,33847,1,1,0,0,0,9.4899999999999998E-2]
[{"$f":"[1]Sheet1!A90","v":"De Lange, Barend J"},{"$f":"[1]Sheet1!B90","v":"8000151"},{"$f":"[1]Sheet1!C90","v":"m"},{"$f":"[1]Sheet1!D90","v":"1970-02-19"},{"$f":"[1]Sheet1!L90","v":"2012-01-09"},"2099-12-31",null,7,7,0.25,0.25,{"$f":"[1]Sheet1!K90","v":91152},{"$f":"[1]Sheet1!I90","v":1},1,{"$f":"[1]Sheet1!M90","v":"2011-06-10"},{"$f":"[1]Sheet1!R90","v":"2018-06-10"},{"$f":"IF(AJ204>0, IF(AJ204<H204, [1]Sheet1!Q90/L204/M204, 0),0)","v":0},{"$f":"IF(AJ204>0, IF(AJ204>=H204, [1]Sheet1!O90/L204/M204 -S204, 0),0)","v":0},{"$f":" IF(AJ204>H204, [1]Sheet1!Q90/L204/M204, 0)","v":0},null,null,null,null,null,null,33847,1,1,0,0,0,9.4899999999999998E-2]
[{"$f":"[1]Sheet1!A91","v":"De Pina, Tracy A"},{"$f":"[1]Sheet1!B91","v":"8000152"},{"$f":"[1]Sheet1!C91","v":"f"},{"$f":"[1]Sheet1!D91","v":"1968-07-16"},{"$f":"[1]Sheet1!L91","v":"2008-08-28"},"2099-12-31",null,7,7,0.25,0.25,{"$f":"[1]Sheet1!K91","v":47116.93},{"$f":"[1]Sheet1!I91","v":0.5},0.5,{"$f":"[1]Sheet1!M91","v":"2011-05-13"},{"$f":"[1]Sheet1!R91","v":"2018-05-13"},{"$f":"IF(AJ205>0, IF(AJ205<H205, [1]Sheet1!Q91/L205/M205, 0),0)","v":0},{"$f":"IF(AJ205>0, IF(AJ205>=H205, [1]Sheet1!O91/L205/M205 -S205, 0),0)","v":0},{"$f":" IF(AJ205>H205, [1]Sheet1!Q91/L205/M205, 0)","v":0},null,null,null,null,null,null,33847,1,1,0,0,0,9.4899999999999998E-2]
[{"$f":"[1]Sheet1!A92","v":"De Ree, Benjamin H"},{"$f":"[1]Sheet1!B92","v":"8000153"},{"$f":"[1]Sheet1!C92","v":"m"},{"$f":"[1]Sheet1!D92","v":"1978-09-12"},{"$f":"[1]Sheet1!L92","v":"2002-06-17"},"2099-12-31",null,7,7,0.25,0.25,{"$f":"[1]Sheet1!K92","v":84599},{"$f":"[1]Sheet1!I92","v":1},1,{"$f":"[1]Sheet1!M92","v":"2010-01-30"},{"$f":"[1]Sheet1!R92","v":"2017-01-30"},{"$f":"IF(AJ206>0, IF(AJ206<H206, [1]Sheet1!Q92/L206/M206, 0),0)","v":0},{"$f":"IF(AJ206>0, IF(AJ206>=H206, [1]Sheet1!O92/L206/M206 -S206, 0),0)","v":0},{"$f":" IF(AJ206>H206, [1]Sheet1!Q92/L206/M206, 0)","v":0},null,null,null,null,null,null,33847,1,1,0,0,0,9.4899999999999998E-2]
[{"$f":"[1]Sheet1!A93","v":"Del Rosario, Maria S"},{"$f":"[1]Sheet1!B93","v":"8000154"},{"$f":"[1]Sheet1!C93","v":"f"},{"$f":"[1]Sheet1!D93","v":"1981-12-10"},{"$f":"[1]Sheet1!L93","v":"2014-10-06"},"2099-12-31",null,7,7,0.25,0.25,{"$f":"[1]Sheet1!K93","v":71723},{"$f":"[1]Sheet1!I93","v":0.6},0.6,{"$f":"[1]Sheet1!M93","v":"2014-11-30"},{"$f":"[1]Sheet1!R93","v":"2021-11-30"},{"$f":"IF(AJ207>0, IF(AJ207<H207, [1]Sheet1!Q93/L207/M207, 0),0)","v":0},{"$f":"IF(AJ207>0, IF(AJ207>=H207, [1]Sheet1!O93/L207/M207 -S207, 0),0)","v":0},{"$f":" IF(AJ207>H207, [1]Sheet1!Q93/L207/M207, 0)","v":0},null,null,null,null,null,null,33847,1,1,0,0,0,9.4899999999999998E-2]
[{"$f":"[1]Sheet1!A94","v":"Desmond, Minnetta"},{"$f":"[1]Sheet1!B94","v":"8000156"},{"$f":"[1]Sheet1!C94","v":"f"},{"$f":"[1]Sheet1!D94","v":"1973-05-27"},{"$f":"[1]Sheet1!L94","v":"2010-10-25"},"2099-12-31",null,7,7,0.25,0.25,{"$f":"[1]Sheet1!K94","v":99345},{"$f":"[1]Sheet1!I94","v":1},1,{"$f":"[1]Sheet1!M94","v":"2011-03-09"},{"$f":"[1]Sheet1!R94","v":"2018-03-09"},{"$f":"IF(AJ208>0, IF(AJ208<H208, [1]Sheet1!Q94/L208/M208, 0),0)","v":0},{"$f":"IF(AJ208>0, IF(AJ208>=H208, [1]Sheet1!O94/L208/M208 -S208, 0),0)","v":0},{"$f":" IF(AJ208>H208, [1]Sheet1!Q94/L208/M208, 0)","v":0},null,null,null,null,null,null,33847,1,1,0,0,0,9.4899999999999998E-2]
[{"$f":"[1]Sheet1!A95","v":"Ditchfield, Kristen"},{"$f":"[1]Sheet1!B95","v":"8000160"},{"$f":"[1]Sheet1!C95","v":"f"},{"$f":"[1]Sheet1!D95","v":"1978-01-11"},{"$f":"[1]Sheet1!L95","v":"2008-12-19"},"2099-12-31",null,7,7,0.25,0.25,{"$f":"[1]Sheet1!K95","v":64256},{"$f":"[1]Sheet1!I95","v":0.8},0.8,{"$f":"[1]Sheet1!M95","v":"2016-07-11"},{"$f":"[1]Sheet1!R95","v":"2023-07-11"},{"$f":"IF(AJ209>0, IF(AJ209<H209, [1]Sheet1!Q95/L209/M209, 0),0)","v":0},{"$f":"IF(AJ209>0, IF(AJ209>=H209, [1]Sheet1!O95/L209/M209 -S209, 0),0)","v":0},{"$f":" IF(AJ209>H209, [1]Sheet1!Q95/L209/M209, 0)","v":0},null,null,null,null,null,null,33847,1,1,0,0,0,9.4899999999999998E-2]
[{"$f":"[1]Sheet1!A96","v":"Dodds, Larissa N"},{"$f":"[1]Sheet1!B96","v":"8000161"},{"$f":"[1]Sheet1!C96","v":"f"},{"$f":"[1]Sheet1!D96","v":"1984-12-26"},{"$f":"[1]Sheet1!L96","v":"2012-09-28"},"2099-12-31",null,7,7,0.25,0.25,{"$f":"[1]Sheet1!K96","v":93994},{"$f":"[1]Sheet1!I96","v":1},1,{"$f":"[1]Sheet1!M96","v":"2012-10-18"},{"$f":"[1]Sheet1!R96","v":"2019-10-18"},{"$f":"IF(AJ210>0, IF(AJ210<H210, [1]Sheet1!Q96/L210/M210, 0),0)","v":0},{"$f":"IF(AJ210>0, IF(AJ210>=H210, [1]Sheet1!O96/L210/M210 -S210, 0),0)","v":0},{"$f":" IF(AJ210>H210, [1]Sheet1!Q96/L210/M210, 0)","v":0},null,null,null,null,null,null,33847,1,1,0,0,0,9.4899999999999998E-2]
[{"$f":"[1]Sheet1!A97","v":"Donald, Paula J"},{"$f":"[1]Sheet1!B97","v":"8000162"},{"$f":"[1]Sheet1!C97","v":"f"},{"$f":"[1]Sheet1!D97","v":"1962-07-18"},{"$f":"[1]Sheet1!L97","v":"1995-02-02"},"2099-12-31",null,7,7,0.25,0.25,{"$f":"[1]Sheet1!K97","v":111106},{"$f":"[1]Sheet1!I97","v":1},1,{"$f":"[1]Sheet1!M97","v":"2017-02-13"},{"$f":"[1]Sheet1!R97","v":"2024-02-13"},{"$f":"IF(AJ211>0, IF(AJ211<H211, [1]Sheet1!Q97/L211/M211, 0),0)","v":0},{"$f":"IF(AJ211>0, IF(AJ211>=H211, [1]Sheet1!O97/L211/M211 -S211, 0),0)","v":0},{"$f":" IF(AJ211>H211, [1]Sheet1!Q97/L211/M211, 0)","v":0},null,null,null,null,null,null,33847,1,1,0,0,0,9.4899999999999998E-2]
[{"$f":"[1]Sheet1!A98","v":"Draper, Mark"},{"$f":"[1]Sheet1!B98","v":"8000164"},{"$f":"[1]Sheet1!C98","v":"m"},{"$f":"[1]Sheet1!D98","v":"1967-01-28"},{"$f":"[1]Sheet1!L98","v":"2014-12-02"},"2099-12-31",null,7,7,0.25,0.25,{"$f":"[1]Sheet1!K98","v":93994},{"$f":"[1]Sheet1!I98","v":1},1,{"$f":"[1]Sheet1!M98","v":"2011-09-11"},{"$f":"[1]Sheet1!R98","v":"2018-09-11"},{"$f":"IF(AJ212>0, IF(AJ212<H212, [1]Sheet1!Q98/L212/M212, 0),0)","v":0},{"$f":"IF(AJ212>0, IF(AJ212>=H212, [1]Sheet1!O98/L212/M212 -S212, 0),0)","v":0},{"$f":" IF(AJ212>H212, [1]Sheet1!Q98/L212/M212, 0)","v":0},null,null,null,null,null,null,33847,1,1,0,0,0,9.4899999999999998E-2]
[{"$f":"[1]Sheet1!A99","v":"Drummond, Eric J"},{"$f":"[1]Sheet1!B99","v":"8000165"},{"$f":"[1]Sheet1!C99","v":"m"},{"$f":"[1]Sheet1!D99","v":"1975-10-15"},{"$f":"[1]Sheet1!L99","v":"2013-06-10"},"2099-12-31",null,7,7,0.25,0.25,{"$f":"[1]Sheet1!K99","v":81502},{"$f":"[1]Sheet1!I99","v":1},1,{"$f":"[1]Sheet1!M99","v":"2013-07-23"},{"$f":"[1]Sheet1!R99","v":"2020-07-23"},{"$f":"IF(AJ213>0, IF(AJ213<H213, [1]Sheet1!Q99/L213/M213, 0),0)","v":0},{"$f":"IF(AJ213>0, IF(AJ213>=H213, [1]Sheet1!O99/L213/M213 -S213, 0),0)","v":0},{"$f":" IF(AJ213>H213, [1]Sheet1!Q99/L213/M213, 0)","v":0},null,null,null,null,null,null,33847,1,1,0,0,0,9.4899999999999998E-2]
[{"$f":"[1]Sheet1!A100","v":"Duddy, Samantha L G"},{"$f":"[1]Sheet1!B100","v":"8000166"},{"$f":"[1]Sheet1!C100","v":"f"},{"$f":"[1]Sheet1!D100","v":"1970-06-20"},{"$f":"[1]Sheet1!L100","v":"2015-03-09"},"2099-12-31",null,7,7,0.25,0.25,{"$f":"[1]Sheet1!K100","v":91152},{"$f":"[1]Sheet1!I100","v":1},1,{"$f":"[1]Sheet1!M100","v":"2015-05-04"},{"$f":"[1]Sheet1!R100","v":"2022-05-04"},{"$f":"IF(AJ214>0, IF(AJ214<H214, [1]Sheet1!Q100/L214/M214, 0),0)","v":0},{"$f":"IF(AJ214>0, IF(AJ214>=H214, [1]Sheet1!O100/L214/M214 -S214, 0),0)","v":0},{"$f":" IF(AJ214>H214, [1]Sheet1!Q100/L214/M214, 0)","v":0},null,null,null,null,null,null,33847,1,1,0,0,0,9.4899999999999998E-2]
[{"$f":"[1]Sheet1!A101","v":"Duffy, Lorraine"},{"$f":"[1]Sheet1!B101","v":"8000167"},{"$f":"[1]Sheet1!C101","v":"f"},{"$f":"[1]Sheet1!D101","v":"1962-11-15"},{"$f":"[1]Sheet1!L101","v":"2016-08-12"},"2099-12-31",null,7,7,0.25,0.25,{"$f":"[1]Sheet1!K101","v":80797},{"$f":"[1]Sheet1!I101","v":1},1,{"$f":"[1]Sheet1!M101","v":"2016-10-12"},{"$f":"[1]Sheet1!R101","v":"2023-10-12"},{"$f":"IF(AJ215>0, IF(AJ215<H215, [1]Sheet1!Q101/L215/M215, 0),0)","v":0},{"$f":"IF(AJ215>0, IF(AJ215>=H215, [1]Sheet1!O101/L215/M215 -S215, 0),0)","v":0},{"$f":" IF(AJ215>H215, [1]Sheet1!Q101/L215/M215, 0)","v":0},null,null,null,null,null,null,33847,1,1,0,0,0,9.4899999999999998E-2]
[{"$f":"[1]Sheet1!A102","v":"Dulihanty, Graham"},{"$f":"[1]Sheet1!B102","v":"8000168"},{"$f":"[1]Sheet1!C102","v":"m"},{"$f":"[1]Sheet1!D102","v":"1953-09-09"},{"$f":"[1]Sheet1!L102","v":"2011-08-29"},"2099-12-31",null,7,7,0.25,0.25,{"$f":"[1]Sheet1!K102","v":98211},{"$f":"[1]Sheet1!I102","v":1},1,{"$f":"[1]Sheet1!M102","v":"2011-09-11"},{"$f":"[1]Sheet1!R102","v":"2018-09-11"},{"$f":"IF(AJ216>0, IF(AJ216<H216, [1]Sheet1!Q102/L216/M216, 0),0)","v":0},{"$f":"IF(AJ216>0, IF(AJ216>=H216, [1]Sheet1!O102/L216/M216 -S216, 0),0)","v":0},{"$f":" IF(AJ216>H216, [1]Sheet1!Q102/L216/M216, 0)","v":0},null,null,null,null,null,null,33847,1,1,0,0,0,9.4899999999999998E-2]
[{"$f":"[1]Sheet1!A103","v":"Dunn, Wendy"},{"$f":"[1]Sheet1!B103","v":"8000169"},{"$f":"[1]Sheet1!C103","v":"f"},{"$f":"[1]Sheet1!D103","v":"1967-12-13"},{"$f":"[1]Sheet1!L103","v":"2008-07-21"},"2099-12-31",null,7,7,0.25,0.25,{"$f":"[1]Sheet1!K103","v":99345},{"$f":"[1]Sheet1!I103","v":0.5},0.5,{"$f":"[1]Sheet1!M103","v":"2015-10-05"},{"$f":"[1]Sheet1!R103","v":"2022-10-05"},{"$f":"IF(AJ217>0, IF(AJ217<H217, [1]Sheet1!Q103/L217/M217, 0),0)","v":0},{"$f":"IF(AJ217>0, IF(AJ217>=H217, [1]Sheet1!O103/L217/M217 -S217, 0),0)","v":0},{"$f":" IF(AJ217>H217, [1]Sheet1!Q103/L217/M217, 0)","v":0},null,null,null,null,null,null,33847,1,1,0,0,0,9.4899999999999998E-2]
[{"$f":"[1]Sheet1!A104","v":"Dunstone, Alan"},{"$f":"[1]Sheet1!B104","v":"8000171"},{"$f":"[1]Sheet1!C104","v":"m"},{"$f":"[1]Sheet1!D104","v":"1969-04-19"},{"$f":"[1]Sheet1!L104","v":"2014-03-04"},"2099-12-31",null,7,7,0.25,0.25,{"$f":"[1]Sheet1!K104","v":84599},{"$f":"[1]Sheet1!I104","v":1},1,{"$f":"[1]Sheet1!M104","v":"2014-04-27"},{"$f":"[1]Sheet1!R104","v":"2021-04-27"},{"$f":"IF(AJ218>0, IF(AJ218<H218, [1]Sheet1!Q104/L218/M218, 0),0)","v":0},{"$f":"IF(AJ218>0, IF(AJ218>=H218, [1]Sheet1!O104/L218/M218 -S218, 0),0)","v":0},{"$f":" IF(AJ218>H218, [1]Sheet1!Q104/L218/M218, 0)","v":0},null,null,null,null,null,null,33847,1,1,0,0,0,9.4899999999999998E-2]
[{"$f":"[1]Sheet1!A105","v":"Durkin, Michelle"},{"$f":"[1]Sheet1!B105","v":"8000172"},{"$f":"[1]Sheet1!C105","v":"f"},{"$f":"[1]Sheet1!D105","v":"1968-01-03"},{"$f":"[1]Sheet1!L105","v":"2011-01-01"},"2099-12-31",null,7,7,0.25,0.25,{"$f":"[1]Sheet1!K105","v":80797},{"$f":"[1]Sheet1!I105","v":1},1,{"$f":"[1]Sheet1!M105","v":"2011-01-06"},{"$f":"[1]Sheet1!R105","v":"2018-01-06"},{"$f":"IF(AJ219>0, IF(AJ219<H219, [1]Sheet1!Q105/L219/M219, 0),0)","v":0},{"$f":"IF(AJ219>0, IF(AJ219>=H219, [1]Sheet1!O105/L219/M219 -S219, 0),0)","v":0},{"$f":" IF(AJ219>H219, [1]Sheet1!Q105/L219/M219, 0)","v":0},null,null,null,null,null,null,33847,1,1,0,0,0,9.4899999999999998E-2]
[{"$f":"[1]Sheet1!A106","v":"Dymond, Wendy"},{"$f":"[1]Sheet1!B106","v":"8000174"},{"$f":"[1]Sheet1!C106","v":"f"},{"$f":"[1]Sheet1!D106","v":"1963-09-06"},{"$f":"[1]Sheet1!L106","v":"2013-05-23"},"2099-12-31",null,7,7,0.25,0.25,{"$f":"[1]Sheet1!K106","v":99345},{"$f":"[1]Sheet1!I106","v":0.38},0.38,{"$f":"[1]Sheet1!M106","v":"2015-09-04"},{"$f":"[1]Sheet1!R106","v":"2022-09-04"},{"$f":"IF(AJ220>0, IF(AJ220<H220, [1]Sheet1!Q106/L220/M220, 0),0)","v":0},{"$f":"IF(AJ220>0, IF(AJ220>=H220, [1]Sheet1!O106/L220/M220 -S220, 0),0)","v":0},{"$f":" IF(AJ220>H220, [1]Sheet1!Q106/L220/M220, 0)","v":0},null,null,null,null,null,null,33847,1,1,0,0,0,9.4899999999999998E-2]
[{"$f":"[1]Sheet1!A107","v":"Edwards, Michele A"},{"$f":"[1]Sheet1!B107","v":"8000179"},{"$f":"[1]Sheet1!C107","v":"f"},{"$f":"[1]Sheet1!D107","v":"1970-08-04"},{"$f":"[1]Sheet1!L107","v":"2005-01-11"},"2099-12-31",null,7,7,0.25,0.25,{"$f":"[1]Sheet1!K107","v":111106},{"$f":"[1]Sheet1!I107","v":1},1,{"$f":"[1]Sheet1!M107","v":"2012-05-16"},{"$f":"[1]Sheet1!R107","v":"2019-05-16"},{"$f":"IF(AJ221>0, IF(AJ221<H221, [1]Sheet1!Q107/L221/M221, 0),0)","v":0},{"$f":"IF(AJ221>0, IF(AJ221>=H221, [1]Sheet1!O107/L221/M221 -S221, 0),0)","v":0},{"$f":" IF(AJ221>H221, [1]Sheet1!Q107/L221/M221, 0)","v":0},null,null,null,null,null,null,33847,1,1,0,0,0,9.4899999999999998E-2]
[{"$f":"[1]Sheet1!A108","v":"Edwards, Nina K"},{"$f":"[1]Sheet1!B108","v":"8000180"},{"$f":"[1]Sheet1!C108","v":"f"},{"$f":"[1]Sheet1!D108","v":"1978-02-09"},{"$f":"[1]Sheet1!L108","v":"2015-12-14"},"2099-12-31",null,7,7,0.25,0.25,{"$f":"[1]Sheet1!K108","v":84599},{"$f":"[1]Sheet1!I108","v":1},1,{"$f":"[1]Sheet1!M108","v":"2016-02-06"},{"$f":"[1]Sheet1!R108","v":"2023-02-06"},{"$f":"IF(AJ222>0, IF(AJ222<H222, [1]Sheet1!Q108/L222/M222, 0),0)","v":0},{"$f":"IF(AJ222>0, IF(AJ222>=H222, [1]Sheet1!O108/L222/M222 -S222, 0),0)","v":0},{"$f":" IF(AJ222>H222, [1]Sheet1!Q108/L222/M222, 0)","v":0},null,null,null,null,null,null,33847,1,1,0,0,0,9.4899999999999998E-2]
[{"$f":"[1]Sheet1!A109","v":"Egloff, Jurg"},{"$f":"[1]Sheet1!B109","v":"8000182"},{"$f":"[1]Sheet1!C109","v":"m"},{"$f":"[1]Sheet1!D109","v":"1962-08-29"},{"$f":"[1]Sheet1!L109","v":"2006-07-31"},"2099-12-31",null,7,7,0.25,0.25,{"$f":"[1]Sheet1!K109","v":87815},{"$f":"[1]Sheet1!I109","v":1},1,{"$f":"[1]Sheet1!M109","v":"2013-10-23"},{"$f":"[1]Sheet1!R109","v":"2020-10-23"},{"$f":"IF(AJ223>0, IF(AJ223<H223, [1]Sheet1!Q109/L223/M223, 0),0)","v":0},{"$f":"IF(AJ223>0, IF(AJ223>=H223, [1]Sheet1!O109/L223/M223 -S223, 0),0)","v":0},{"$f":" IF(AJ223>H223, [1]Sheet1!Q109/L223/M223, 0)","v":0},null,null,null,null,null,null,33847,1,1,0,0,0,9.4899999999999998E-2]
[{"$f":"[1]Sheet1!A110","v":"Ellis, Elizabeth M"},{"$f":"[1]Sheet1!B110","v":"8000184"},{"$f":"[1]Sheet1!C110","v":"f"},{"$f":"[1]Sheet1!D110","v":"1966-12-30"},{"$f":"[1]Sheet1!L110","v":"2010-08-04"},"2099-12-31",null,7,7,0.25,0.25,{"$f":"[1]Sheet1!K110","v":107041},{"$f":"[1]Sheet1!I110","v":1},1,{"$f":"[1]Sheet1!M110","v":"2010-09-04"},{"$f":"[1]Sheet1!R110","v":"2017-09-04"},{"$f":"IF(AJ224>0, IF(AJ224<H224, [1]Sheet1!Q110/L224/M224, 0),0)","v":0},{"$f":"IF(AJ224>0, IF(AJ224>=H224, [1]Sheet1!O110/L224/M224 -S224, 0),0)","v":0},{"$f":" IF(AJ224>H224, [1]Sheet1!Q110/L224/M224, 0)","v":0},null,null,null,null,null,null,33847,1,1,0,0,0,9.4899999999999998E-2]
[{"$f":"[1]Sheet1!A111","v":"Ellis, Yvonne M"},{"$f":"[1]Sheet1!B111","v":"8000185"},{"$f":"[1]Sheet1!C111","v":"f"},{"$f":"[1]Sheet1!D111","v":"1953-04-01"},{"$f":"[1]Sheet1!L111","v":"1995-01-23"},"2099-12-31",null,7,7,0.25,0.25,{"$f":"[1]Sheet1!K111","v":105816},{"$f":"[1]Sheet1!I111","v":1},1,{"$f":"[1]Sheet1!M111","v":"2016-09-10"},{"$f":"[1]Sheet1!R111","v":"2023-09-10"},{"$f":"IF(AJ225>0, IF(AJ225<H225, [1]Sheet1!Q111/L225/M225, 0),0)","v":0},{"$f":"IF(AJ225>0, IF(AJ225>=H225, [1]Sheet1!O111/L225/M225 -S225, 0),0)","v":0},{"$f":" IF(AJ225>H225, [1]Sheet1!Q111/L225/M225, 0)","v":0},null,null,null,null,null,null,33847,1,1,0,0,0,9.4899999999999998E-2]
[{"$f":"[1]Sheet1!A112","v":"Evans, Benjamin"},{"$f":"[1]Sheet1!B112","v":"8000186"},{"$f":"[1]Sheet1!C112","v":"m"},{"$f":"[1]Sheet1!D112","v":"1979-05-18"},{"$f":"[1]Sheet1!L112","v":"2014-02-03"},"2099-12-31",null,7,7,0.25,0.25,{"$f":"[1]Sheet1!K112","v":78517},{"$f":"[1]Sheet1!I112","v":1},1,{"$f":"[1]Sheet1!M112","v":"2014-09-29"},{"$f":"[1]Sheet1!R112","v":"2021-09-29"},{"$f":"IF(AJ226>0, IF(AJ226<H226, [1]Sheet1!Q112/L226/M226, 0),0)","v":0},{"$f":"IF(AJ226>0, IF(AJ226>=H226, [1]Sheet1!O112/L226/M226 -S226, 0),0)","v":0},{"$f":" IF(AJ226>H226, [1]Sheet1!Q112/L226/M226, 0)","v":0},null,null,null,null,null,null,33847,1,1,0,0,0,9.4899999999999998E-2]
[{"$f":"[1]Sheet1!A113","v":"Everett, Frances"},{"$f":"[1]Sheet1!B113","v":"8000188"},{"$f":"[1]Sheet1!C113","v":"f"},{"$f":"[1]Sheet1!D113","v":"1961-03-24"},{"$f":"[1]Sheet1!L113","v":"2016-04-21"},"2099-12-31",null,7,7,0.25,0.25,{"$f":"[1]Sheet1!K113","v":124033},{"$f":"[1]Sheet1!I113","v":1},1,{"$f":"[1]Sheet1!M113","v":"2016-10-12"},{"$f":"[1]Sheet1!R113","v":"2023-10-12"},{"$f":"IF(AJ227>0, IF(AJ227<H227, [1]Sheet1!Q113/L227/M227, 0),0)","v":0},{"$f":"IF(AJ227>0, IF(AJ227>=H227, [1]Sheet1!O113/L227/M227 -S227, 0),0)","v":0},{"$f":" IF(AJ227>H227, [1]Sheet1!Q113/L227/M227, 0)","v":0},null,null,null,null,null,null,33847,1,1,0,0,0,9.4899999999999998E-2]
[{"$f":"[1]Sheet1!A114","v":"Fariss, Melita D"},{"$f":"[1]Sheet1!B114","v":"8000190"},{"$f":"[1]Sheet1!C114","v":"f"},{"$f":"[1]Sheet1!D114","v":"1976-06-26"},{"$f":"[1]Sheet1!L114","v":"2016-07-29"},"2099-12-31",null,7,7,0.25,0.25,{"$f":"[1]Sheet1!K114","v":64256},{"$f":"[1]Sheet1!I114","v":1},1,{"$f":"[1]Sheet1!M114","v":"2016-09-11"},{"$f":"[1]Sheet1!R114","v":"2023-09-11"},{"$f":"IF(AJ228>0, IF(AJ228<H228, [1]Sheet1!Q114/L228/M228, 0),0)","v":0},{"$f":"IF(AJ228>0, IF(AJ228>=H228, [1]Sheet1!O114/L228/M228 -S228, 0),0)","v":0},{"$f":" IF(AJ228>H228, [1]Sheet1!Q114/L228/M228, 0)","v":0},null,null,null,null,null,null,33847,1,1,0,0,0,9.4899999999999998E-2]
[{"$f":"[1]Sheet1!A115","v":"Fergusson, Brian"},{"$f":"[1]Sheet1!B115","v":"8000193"},{"$f":"[1]Sheet1!C115","v":"m"},{"$f":"[1]Sheet1!D115","v":"1955-09-03"},{"$f":"[1]Sheet1!L115","v":"2011-01-01"},"2099-12-31",null,7,7,0.25,0.25,{"$f":"[1]Sheet1!K115","v":109838},{"$f":"[1]Sheet1!I115","v":1},1,{"$f":"[1]Sheet1!M115","v":"2011-01-06"},{"$f":"[1]Sheet1!R115","v":"2018-01-06"},{"$f":"IF(AJ229>0, IF(AJ229<H229, [1]Sheet1!Q115/L229/M229, 0),0)","v":0},{"$f":"IF(AJ229>0, IF(AJ229>=H229, [1]Sheet1!O115/L229/M229 -S229, 0),0)","v":0},{"$f":" IF(AJ229>H229, [1]Sheet1!Q115/L229/M229, 0)","v":0},null,null,null,null,null,null,33847,1,1,0,0,0,9.4899999999999998E-2]
[{"$f":"[1]Sheet1!A116","v":"Fiegert, Michael S"},{"$f":"[1]Sheet1!B116","v":"8000194"},{"$f":"[1]Sheet1!C116","v":"m"},{"$f":"[1]Sheet1!D116","v":"1965-02-12"},{"$f":"[1]Sheet1!L116","v":"2009-02-05"},"2099-12-31",null,7,7,0.25,0.25,{"$f":"[1]Sheet1!K116","v":87815},{"$f":"[1]Sheet1!I116","v":1},1,{"$f":"[1]Sheet1!M116","v":"2016-04-09"},{"$f":"[1]Sheet1!R116","v":"2023-04-09"},{"$f":"IF(AJ230>0, IF(AJ230<H230, [1]Sheet1!Q116/L230/M230, 0),0)","v":0},{"$f":"IF(AJ230>0, IF(AJ230>=H230, [1]Sheet1!O116/L230/M230 -S230, 0),0)","v":0},{"$f":" IF(AJ230>H230, [1]Sheet1!Q116/L230/M230, 0)","v":0},null,null,null,null,null,null,33847,1,1,0,0,0,9.4899999999999998E-2]
[{"$f":"[1]Sheet1!A117","v":"Fiorenza, Kayelene D"},{"$f":"[1]Sheet1!B117","v":"8000195"},{"$f":"[1]Sheet1!C117","v":"f"},{"$f":"[1]Sheet1!D117","v":"1953-09-02"},{"$f":"[1]Sheet1!L117","v":"2005-02-09"},"2099-12-31",null,7,7,0.25,0.25,{"$f":"[1]Sheet1!K117","v":60781},{"$f":"[1]Sheet1!I117","v":1},1,{"$f":"[1]Sheet1!M117","v":"2011-09-11"},{"$f":"[1]Sheet1!R117","v":"2018-09-11"},{"$f":"IF(AJ231>0, IF(AJ231<H231, [1]Sheet1!Q117/L231/M231, 0),0)","v":0},{"$f":"IF(AJ231>0, IF(AJ231>=H231, [1]Sheet1!O117/L231/M231 -S231, 0),0)","v":0},{"$f":" IF(AJ231>H231, [1]Sheet1!Q117/L231/M231, 0)","v":0},null,null,null,null,null,null,33847,1,1,0,0,0,9.4899999999999998E-2]
[{"$f":"[1]Sheet1!A118","v":"Fisher, James S A"},{"$f":"[1]Sheet1!B118","v":"8000197"},{"$f":"[1]Sheet1!C118","v":"m"},{"$f":"[1]Sheet1!D118","v":"1965-09-30"},{"$f":"[1]Sheet1!L118","v":"2013-10-22"},"2099-12-31",null,7,7,0.25,0.25,{"$f":"[1]Sheet1!K118","v":115329},{"$f":"[1]Sheet1!I118","v":0.5},0.5,{"$f":"[1]Sheet1!M118","v":"2015-03-03"},{"$f":"[1]Sheet1!R118","v":"2022-03-03"},{"$f":"IF(AJ232>0, IF(AJ232<H232, [1]Sheet1!Q118/L232/M232, 0),0)","v":0},{"$f":"IF(AJ232>0, IF(AJ232>=H232, [1]Sheet1!O118/L232/M232 -S232, 0),0)","v":0},{"$f":" IF(AJ232>H232, [1]Sheet1!Q118/L232/M232, 0)","v":0},null,null,null,null,null,null,33847,1,1,0,0,0,9.4899999999999998E-2]
[{"$f":"[1]Sheet1!A119","v":"Fitzpatrick, Leeanne"},{"$f":"[1]Sheet1!B119","v":"8000198"},{"$f":"[1]Sheet1!C119","v":"f"},{"$f":"[1]Sheet1!D119","v":"1956-06-04"},{"$f":"[1]Sheet1!L119","v":"2014-12-12"},"2099-12-31",null,7,7,0.25,0.25,{"$f":"[1]Sheet1!K119","v":91152},{"$f":"[1]Sheet1!I119","v":1},1,{"$f":"[1]Sheet1!M119","v":"2015-09-01"},{"$f":"[1]Sheet1!R119","v":"2022-09-01"},{"$f":"IF(AJ233>0, IF(AJ233<H233, [1]Sheet1!Q119/L233/M233, 0),0)","v":0},{"$f":"IF(AJ233>0, IF(AJ233>=H233, [1]Sheet1!O119/L233/M233 -S233, 0),0)","v":0},{"$f":" IF(AJ233>H233, [1]Sheet1!Q119/L233/M233, 0)","v":0},null,null,null,null,null,null,33847,1,1,0,0,0,9.4899999999999998E-2]
[{"$f":"[1]Sheet1!A120","v":"Fleeton, Beverley I"},{"$f":"[1]Sheet1!B120","v":"8000199"},{"$f":"[1]Sheet1!C120","v":"f"},{"$f":"[1]Sheet1!D120","v":"1959-05-01"},{"$f":"[1]Sheet1!L120","v":"2012-09-10"},"2099-12-31",null,7,7,0.25,0.25,{"$f":"[1]Sheet1!K120","v":64256},{"$f":"[1]Sheet1!I120","v":1},1,{"$f":"[1]Sheet1!M120","v":"2012-11-18"},{"$f":"[1]Sheet1!R120","v":"2019-11-18"},{"$f":"IF(AJ234>0, IF(AJ234<H234, [1]Sheet1!Q120/L234/M234, 0),0)","v":0},{"$f":"IF(AJ234>0, IF(AJ234>=H234, [1]Sheet1!O120/L234/M234 -S234, 0),0)","v":0},{"$f":" IF(AJ234>H234, [1]Sheet1!Q120/L234/M234, 0)","v":0},null,null,null,null,null,null,33847,1,1,0,0,0,9.4899999999999998E-2]
[{"$f":"[1]Sheet1!A121","v":"Fleming, Thomas C"},{"$f":"[1]Sheet1!B121","v":"8000200"},{"$f":"[1]Sheet1!C121","v":"m"},{"$f":"[1]Sheet1!D121","v":"1950-05-12"},{"$f":"[1]Sheet1!L121","v":"2007-05-07"},"2099-12-31",null,7,7,0.25,0.25,{"$f":"[1]Sheet1!K121","v":87815},{"$f":"[1]Sheet1!I121","v":1},1,{"$f":"[1]Sheet1!M121","v":"2014-09-29"},{"$f":"[1]Sheet1!R121","v":"2021-09-29"},{"$f":"IF(AJ235>0, IF(AJ235<H235, [1]Sheet1!Q121/L235/M235, 0),0)","v":0},{"$f":"IF(AJ235>0, IF(AJ235>=H235, [1]Sheet1!O121/L235/M235 -S235, 0),0)","v":0},{"$f":" IF(AJ235>H235, [1]Sheet1!Q121/L235/M235, 0)","v":0},null,null,null,null,null,null,33847,1,1,0,0,0,9.4899999999999998E-2]
[{"$f":"[1]Sheet1!A122","v":"Forbes, Peter L"},{"$f":"[1]Sheet1!B122","v":"8000201"},{"$f":"[1]Sheet1!C122","v":"m"},{"$f":"[1]Sheet1!D122","v":"1952-05-06"},{"$f":"[1]Sheet1!L122","v":"1994-02-03"},"2099-12-31",null,7,7,0.25,0.25,{"$f":"[1]Sheet1!K122","v":105816},{"$f":"[1]Sheet1!I122","v":1},1,{"$f":"[1]Sheet1!M122","v":"2016-06-10"},{"$f":"[1]Sheet1!R122","v":"2023-06-10"},{"$f":"IF(AJ236>0, IF(AJ236<H236, [1]Sheet1!Q122/L236/M236, 0),0)","v":0},{"$f":"IF(AJ236>0, IF(AJ236>=H236, [1]Sheet1!O122/L236/M236 -S236, 0),0)","v":0},{"$f":" IF(AJ236>H236, [1]Sheet1!Q122/L236/M236, 0)","v":0},null,null,null,null,null,null,33847,1,1,0,0,0,9.4899999999999998E-2]
[{"$f":"[1]Sheet1!A123","v":"Forrester, Michelle J"},{"$f":"[1]Sheet1!B123","v":"8000202"},{"$f":"[1]Sheet1!C123","v":"f"},{"$f":"[1]Sheet1!D123","v":"1974-07-08"},{"$f":"[1]Sheet1!L123","v":"2015-06-02"},"2099-12-31",null,7,7,0.25,0.25,{"$f":"[1]Sheet1!K123","v":81502},{"$f":"[1]Sheet1!I123","v":1},1,{"$f":"[1]Sheet1!M123","v":"2015-08-04"},{"$f":"[1]Sheet1!R123","v":"2022-08-04"},{"$f":"IF(AJ237>0, IF(AJ237<H237, [1]Sheet1!Q123/L237/M237, 0),0)","v":0},{"$f":"IF(AJ237>0, IF(AJ237>=H237, [1]Sheet1!O123/L237/M237 -S237, 0),0)","v":0},{"$f":" IF(AJ237>H237, [1]Sheet1!Q123/L237/M237, 0)","v":0},null,null,null,null,null,null,33847,1,1,0,0,0,9.4899999999999998E-2]
[{"$f":"[1]Sheet1!A124","v":"Forsyth, Dale E"},{"$f":"[1]Sheet1!B124","v":"8000203"},{"$f":"[1]Sheet1!C124","v":"m"},{"$f":"[1]Sheet1!D124","v":"1965-07-21"},{"$f":"[1]Sheet1!L124","v":"1993-07-26"},"2099-12-31",null,7,7,0.25,0.25,{"$f":"[1]Sheet1!K124","v":78517},{"$f":"[1]Sheet1!I124","v":1},1,{"$f":"[1]Sheet1!M124","v":"2015-05-04"},{"$f":"[1]Sheet1!R124","v":"2022-05-04"},{"$f":"IF(AJ238>0, IF(AJ238<H238, [1]Sheet1!Q124/L238/M238, 0),0)","v":0},{"$f":"IF(AJ238>0, IF(AJ238>=H238, [1]Sheet1!O124/L238/M238 -S238, 0),0)","v":0},{"$f":" IF(AJ238>H238, [1]Sheet1!Q124/L238/M238, 0)","v":0},null,null,null,null,null,null,33847,1,1,0,0,0,9.4899999999999998E-2]
[{"$f":"[1]Sheet1!A125","v":"Forsyth, Judith"},{"$f":"[1]Sheet1!B125","v":"8000204"},{"$f":"[1]Sheet1!C125","v":"f"},{"$f":"[1]Sheet1!D125","v":"1960-02-15"},{"$f":"[1]Sheet1!L125","v":"2006-06-19"},"2099-12-31",null,7,7,0.25,0.25,{"$f":"[1]Sheet1!K125","v":99345},{"$f":"[1]Sheet1!I125","v":1},1,{"$f":"[1]Sheet1!M125","v":"2014-10-30"},{"$f":"[1]Sheet1!R125","v":"2021-10-30"},{"$f":"IF(AJ239>0, IF(AJ239<H239, [1]Sheet1!Q125/L239/M239, 0),0)","v":0},{"$f":"IF(AJ239>0, IF(AJ239>=H239, [1]Sheet1!O125/L239/M239 -S239, 0),0)","v":0},{"$f":" IF(AJ239>H239, [1]Sheet1!Q125/L239/M239, 0)","v":0},null,null,null,null,null,null,33847,1,1,0,0,0,9.4899999999999998E-2]
[{"$f":"[1]Sheet1!A126","v":"Forward, Darryl W"},{"$f":"[1]Sheet1!B126","v":"8000206"},{"$f":"[1]Sheet1!C126","v":"m"},{"$f":"[1]Sheet1!D126","v":"1957-05-28"},{"$f":"[1]Sheet1!L126","v":"2016-09-23"},"2099-12-31",null,7,7,0.25,0.25,{"$f":"[1]Sheet1!K126","v":93994},{"$f":"[1]Sheet1!I126","v":1},1,{"$f":"[1]Sheet1!M126","v":"2013-09-22"},{"$f":"[1]Sheet1!R126","v":"2020-09-22"},{"$f":"IF(AJ240>0, IF(AJ240<H240, [1]Sheet1!Q126/L240/M240, 0),0)","v":0},{"$f":"IF(AJ240>0, IF(AJ240>=H240, [1]Sheet1!O126/L240/M240 -S240, 0),0)","v":0},{"$f":" IF(AJ240>H240, [1]Sheet1!Q126/L240/M240, 0)","v":0},null,null,null,null,null,null,33847,1,1,0,0,0,9.4899999999999998E-2]
[{"$f":"[1]Sheet1!A127","v":"Frain, Andrea"},{"$f":"[1]Sheet1!B127","v":"8000208"},{"$f":"[1]Sheet1!C127","v":"f"},{"$f":"[1]Sheet1!D127","v":"1994-06-27"},{"$f":"[1]Sheet1!L127","v":"2016-09-09"},"2099-12-31",null,7,7,0.25,0.25,{"$f":"[1]Sheet1!K127","v":60781},{"$f":"[1]Sheet1!I127","v":1},1,{"$f":"[1]Sheet1!M127","v":"2016-11-12"},{"$f":"[1]Sheet1!R127","v":"2023-11-12"},{"$f":"IF(AJ241>0, IF(AJ241<H241, [1]Sheet1!Q127/L241/M241, 0),0)","v":0},{"$f":"IF(AJ241>0, IF(AJ241>=H241, [1]Sheet1!O127/L241/M241 -S241, 0),0)","v":0},{"$f":" IF(AJ241>H241, [1]Sheet1!Q127/L241/M241, 0)","v":0},null,null,null,null,null,null,33847,1,1,0,0,0,9.4899999999999998E-2]
[{"$f":"[1]Sheet1!A128","v":"Francis, Pamela M"},{"$f":"[1]Sheet1!B128","v":"8000209"},{"$f":"[1]Sheet1!C128","v":"f"},{"$f":"[1]Sheet1!D128","v":"1950-12-08"},{"$f":"[1]Sheet1!L128","v":"2001-05-21"},"2099-12-31",null,7,7,0.25,0.25,{"$f":"[1]Sheet1!K128","v":73717},{"$f":"[1]Sheet1!I128","v":1},1,{"$f":"[1]Sheet1!M128","v":"2015-10-05"},{"$f":"[1]Sheet1!R128","v":"2022-10-05"},{"$f":"IF(AJ242>0, IF(AJ242<H242, [1]Sheet1!Q128/L242/M242, 0),0)","v":0},{"$f":"IF(AJ242>0, IF(AJ242>=H242, [1]Sheet1!O128/L242/M242 -S242, 0),0)","v":0},{"$f":" IF(AJ242>H242, [1]Sheet1!Q128/L242/M242, 0)","v":0},null,null,null,null,null,null,33847,1,1,0,0,0,9.4899999999999998E-2]
[{"$f":"[1]Sheet1!A129","v":"Franz, Daisy J M"},{"$f":"[1]Sheet1!B129","v":"8000211"},{"$f":"[1]Sheet1!C129","v":"f"},{"$f":"[1]Sheet1!D129","v":"1987-05-11"},{"$f":"[1]Sheet1!L129","v":"2013-07-22"},"2099-12-31",null,7,7,0.25,0.25,{"$f":"[1]Sheet1!K129","v":90896},{"$f":"[1]Sheet1!I129","v":1},1,{"$f":"[1]Sheet1!M129","v":"2014-03-27"},{"$f":"[1]Sheet1!R129","v":"2021-03-27"},{"$f":"IF(AJ243>0, IF(AJ243<H243, [1]Sheet1!Q129/L243/M243, 0),0)","v":0},{"$f":"IF(AJ243>0, IF(AJ243>=H243, [1]Sheet1!O129/L243/M243 -S243, 0),0)","v":0},{"$f":" IF(AJ243>H243, [1]Sheet1!Q129/L243/M243, 0)","v":0},null,null,null,null,null,null,33847,1,1,0,0,0,9.4899999999999998E-2]
[{"$f":"[1]Sheet1!A130","v":"Freer, Benjamin"},{"$f":"[1]Sheet1!B130","v":"8000213"},{"$f":"[1]Sheet1!C130","v":"m"},{"$f":"[1]Sheet1!D130","v":"1972-12-01"},{"$f":"[1]Sheet1!L130","v":"2011-01-10"},"2099-12-31",null,7,7,0.25,0.25,{"$f":"[1]Sheet1!K130","v":91152},{"$f":"[1]Sheet1!I130","v":1},1,{"$f":"[1]Sheet1!M130","v":"2011-02-06"},{"$f":"[1]Sheet1!R130","v":"2018-02-06"},{"$f":"IF(AJ244>0, IF(AJ244<H244, [1]Sheet1!Q130/L244/M244, 0),0)","v":0},{"$f":"IF(AJ244>0, IF(AJ244>=H244, [1]Sheet1!O130/L244/M244 -S244, 0),0)","v":0},{"$f":" IF(AJ244>H244, [1]Sheet1!Q130/L244/M244, 0)","v":0},null,null,null,null,null,null,33847,1,1,0,0,0,9.4899999999999998E-2]
[{"$f":"[1]Sheet1!A131","v":"Fullarton, Simon"},{"$f":"[1]Sheet1!B131","v":"8000217"},{"$f":"[1]Sheet1!C131","v":"m"},{"$f":"[1]Sheet1!D131","v":"1985-10-19"},{"$f":"[1]Sheet1!L131","v":"2014-02-03"},"2099-12-31",null,7,7,0.25,0.25,{"$f":"[1]Sheet1!K131","v":78517},{"$f":"[1]Sheet1!I131","v":1},{"$f":"M245","v":1},{"$f":"[1]Sheet1!M131","v":"2014-03-27"},{"$f":"[1]Sheet1!R131","v":"2021-03-27"},{"$f":"IF(AJ245>0, IF(AJ245<H245, [1]Sheet1!Q131/L245/M245, 0),0)","v":0},{"$f":"IF(AJ245>0, IF(AJ245>=H245, [1]Sheet1!O131/L245/M245 -S245, 0),0)","v":0},{"$f":" IF(AJ245>H245, [1]Sheet1!Q131/L245/M245, 0)","v":0},null,null,null,null,null,null,33847,1,1,0,0,0,9.4899999999999998E-2]
[{"$f":"[1]Sheet1!A132","v":"Galloway, Cheryl A"},{"$f":"[1]Sheet1!B132","v":"8000218"},{"$f":"[1]Sheet1!C132","v":"f"},{"$f":"[1]Sheet1!D132","v":"1955-10-31"},{"$f":"[1]Sheet1!L132","v":"1996-02-01"},"2099-12-31",null,7,7,0.25,0.25,{"$f":"[1]Sheet1!K132","v":111106},{"$f":"[1]Sheet1!I132","v":1},1,{"$f":"[1]Sheet1!M132","v":"2011-08-11"},{"$f":"[1]Sheet1!R132","v":"2018-08-11"},{"$f":"IF(AJ246>0, IF(AJ246<H246, [1]Sheet1!Q132/L246/M246, 0),0)","v":0},{"$f":"IF(AJ246>0, IF(AJ246>=H246, [1]Sheet1!O132/L246/M246 -S246, 0),0)","v":0},{"$f":" IF(AJ246>H246, [1]Sheet1!Q132/L246/M246, 0)","v":0},null,null,null,null,null,null,33847,1,1,0,0,0,9.4899999999999998E-2]
[{"$f":"[1]Sheet1!A133","v":"Galvin, Bernadette F"},{"$f":"[1]Sheet1!B133","v":"8000219"},{"$f":"[1]Sheet1!C133","v":"f"},{"$f":"[1]Sheet1!D133","v":"1960-03-20"},{"$f":"[1]Sheet1!L133","v":"1995-11-03"},"2099-12-31",null,7,7,0.25,0.25,{"$f":"[1]Sheet1!K133","v":57376},{"$f":"[1]Sheet1!I133","v":1},1,{"$f":"[1]Sheet1!M133","v":"2012-03-15"},{"$f":"[1]Sheet1!R133","v":"2019-03-15"},{"$f":"IF(AJ247>0, IF(AJ247<H247, [1]Sheet1!Q133/L247/M247, 0),0)","v":0},{"$f":"IF(AJ247>0, IF(AJ247>=H247, [1]Sheet1!O133/L247/M247 -S247, 0),0)","v":0},{"$f":" IF(AJ247>H247, [1]Sheet1!Q133/L247/M247, 0)","v":0},null,null,null,null,null,null,33847,1,1,0,0,0,9.4899999999999998E-2]
[{"$f":"[1]Sheet1!A134","v":"Gardner, Elizabeth K"},{"$f":"[1]Sheet1!B134","v":"8000220"},{"$f":"[1]Sheet1!C134","v":"f"},{"$f":"[1]Sheet1!D134","v":"1962-12-06"},{"$f":"[1]Sheet1!L134","v":"2006-09-02"},"2099-12-31",null,7,7,0.25,0.25,{"$f":"[1]Sheet1!K134","v":107041},{"$f":"[1]Sheet1!I134","v":1},1,{"$f":"[1]Sheet1!M134","v":"2015-10-05"},{"$f":"[1]Sheet1!R134","v":"2022-10-05"},{"$f":"IF(AJ248>0, IF(AJ248<H248, [1]Sheet1!Q134/L248/M248, 0),0)","v":0},{"$f":"IF(AJ248>0, IF(AJ248>=H248, [1]Sheet1!O134/L248/M248 -S248, 0),0)","v":0},{"$f":" IF(AJ248>H248, [1]Sheet1!Q134/L248/M248, 0)","v":0},null,null,null,null,null,null,33847,1,1,0,0,0,9.4899999999999998E-2]
[{"$f":"[1]Sheet1!A135","v":"Gerada, Kellie"},{"$f":"[1]Sheet1!B135","v":"8000222"},{"$f":"[1]Sheet1!C135","v":"f"},{"$f":"[1]Sheet1!D135","v":"1978-03-20"},{"$f":"[1]Sheet1!L135","v":"2013-09-11"},"2099-12-31",null,7,7,0.25,0.25,{"$f":"[1]Sheet1!K135","v":64256},{"$f":"[1]Sheet1!I135","v":0.8},0.8,{"$f":"[1]Sheet1!M135","v":"2013-10-23"},{"$f":"[1]Sheet1!R135","v":"2020-10-23"},{"$f":"IF(AJ249>0, IF(AJ249<H249, [1]Sheet1!Q135/L249/M249, 0),0)","v":0},{"$f":"IF(AJ249>0, IF(AJ249>=H249, [1]Sheet1!O135/L249/M249 -S249, 0),0)","v":0},{"$f":" IF(AJ249>H249, [1]Sheet1!Q135/L249/M249, 0)","v":0},null,null,null,null,null,null,33847,1,1,0,0,0,9.4899999999999998E-2]
[{"$f":"[1]Sheet1!A136","v":"Gerard, Janine A"},{"$f":"[1]Sheet1!B136","v":"8000223"},{"$f":"[1]Sheet1!C136","v":"f"},{"$f":"[1]Sheet1!D136","v":"1962-06-13"},{"$f":"[1]Sheet1!L136","v":"1994-06-13"},"2099-12-31",null,7,7,0.25,0.25,{"$f":"[1]Sheet1!K136","v":111106},{"$f":"[1]Sheet1!I136","v":1},1,{"$f":"[1]Sheet1!M136","v":"2016-12-17"},{"$f":"[1]Sheet1!R136","v":"2023-12-17"},{"$f":"IF(AJ250>0, IF(AJ250<H250, [1]Sheet1!Q136/L250/M250, 0),0)","v":0},{"$f":"IF(AJ250>0, IF(AJ250>=H250, [1]Sheet1!O136/L250/M250 -S250, 0),0)","v":0},{"$f":" IF(AJ250>H250, [1]Sheet1!Q136/L250/M250, 0)","v":0},null,null,null,null,null,null,33847,1,1,0,0,0,9.4899999999999998E-2]
[{"$f":"[1]Sheet1!A137","v":"Ghinis, Chris"},{"$f":"[1]Sheet1!B137","v":"8000225"},{"$f":"[1]Sheet1!C137","v":"m"},{"$f":"[1]Sheet1!D137","v":"1973-04-13"},{"$f":"[1]Sheet1!L137","v":"2014-08-29"},"2099-12-31",null,7,7,0.25,0.25,{"$f":"[1]Sheet1!K137","v":85577},{"$f":"[1]Sheet1!I137","v":1},1,{"$f":"[1]Sheet1!M137","v":"2014-09-29"},{"$f":"[1]Sheet1!R137","v":"2021-09-29"},{"$f":"IF(AJ251>0, IF(AJ251<H251, [1]Sheet1!Q137/L251/M251, 0),0)","v":0},{"$f":"IF(AJ251>0, IF(AJ251>=H251, [1]Sheet1!O137/L251/M251 -S251, 0),0)","v":0},{"$f":" IF(AJ251>H251, [1]Sheet1!Q137/L251/M251, 0)","v":0},null,null,null,null,null,null,33847,1,1,0,0,0,9.4899999999999998E-2]
[{"$f":"[1]Sheet1!A138","v":"Gibson, Cathy L"},{"$f":"[1]Sheet1!B138","v":"8000227"},{"$f":"[1]Sheet1!C138","v":"f"},{"$f":"[1]Sheet1!D138","v":"1960-04-26"},{"$f":"[1]Sheet1!L138","v":"1995-10-31"},"2099-12-31",null,7,7,0.25,0.25,{"$f":"[1]Sheet1!K138","v":73717},{"$f":"[1]Sheet1!I138","v":1},1,{"$f":"[1]Sheet1!M138","v":"2010-06-03"},{"$f":"[1]Sheet1!R138","v":"2017-06-03"},{"$f":"IF(AJ252>0, IF(AJ252<H252, [1]Sheet1!Q138/L252/M252, 0),0)","v":0},{"$f":"IF(AJ252>0, IF(AJ252>=H252, [1]Sheet1!O138/L252/M252 -S252, 0),0)","v":0},{"$f":" IF(AJ252>H252, [1]Sheet1!Q138/L252/M252, 0)","v":0},null,null,null,null,null,null,33847,1,1,0,0,0,9.4899999999999998E-2]
[{"$f":"[1]Sheet1!A139","v":"Gilchrist, Julie A"},{"$f":"[1]Sheet1!B139","v":"8000229"},{"$f":"[1]Sheet1!C139","v":"f"},{"$f":"[1]Sheet1!D139","v":"1969-05-10"},{"$f":"[1]Sheet1!L139","v":"2009-08-31"},"2099-12-31",null,7,7,0.25,0.25,{"$f":"[1]Sheet1!K139","v":62482},{"$f":"[1]Sheet1!I139","v":1},1,{"$f":"[1]Sheet1!M139","v":"2016-10-12"},{"$f":"[1]Sheet1!R139","v":"2023-10-12"},{"$f":"IF(AJ253>0, IF(AJ253<H253, [1]Sheet1!Q139/L253/M253, 0),0)","v":0},{"$f":"IF(AJ253>0, IF(AJ253>=H253, [1]Sheet1!O139/L253/M253 -S253, 0),0)","v":0},{"$f":" IF(AJ253>H253, [1]Sheet1!Q139/L253/M253, 0)","v":0},null,null,null,null,null,null,33847,1,1,0,0,0,9.4899999999999998E-2]
[{"$f":"[1]Sheet1!A140","v":"Gillespie, Hayden J"},{"$f":"[1]Sheet1!B140","v":"8000230"},{"$f":"[1]Sheet1!C140","v":"m"},{"$f":"[1]Sheet1!D140","v":"1984-08-14"},{"$f":"[1]Sheet1!L140","v":"2012-01-16"},"2099-12-31",null,7,7,0.25,0.25,{"$f":"[1]Sheet1!K140","v":92205},{"$f":"[1]Sheet1!I140","v":1},1,{"$f":"[1]Sheet1!M140","v":"2012-02-12"},{"$f":"[1]Sheet1!R140","v":"2019-02-12"},{"$f":"IF(AJ254>0, IF(AJ254<H254, [1]Sheet1!Q140/L254/M254, 0),0)","v":0},{"$f":"IF(AJ254>0, IF(AJ254>=H254, [1]Sheet1!O140/L254/M254 -S254, 0),0)","v":0},{"$f":" IF(AJ254>H254, [1]Sheet1!Q140/L254/M254, 0)","v":0},null,null,null,null,null,null,33847,1,1,0,0,0,9.4899999999999998E-2]
[{"$f":"[1]Sheet1!A141","v":"Gillett, Natasha"},{"$f":"[1]Sheet1!B141","v":"8000231"},{"$f":"[1]Sheet1!C141","v":"f"},{"$f":"[1]Sheet1!D141","v":"1994-04-07"},{"$f":"[1]Sheet1!L141","v":"2012-05-02"},"2099-12-31",null,7,7,0.25,0.25,{"$f":"[1]Sheet1!K141","v":48930},{"$f":"[1]Sheet1!I141","v":1},1,{"$f":"[1]Sheet1!M141","v":"2012-06-16"},{"$f":"[1]Sheet1!R141","v":"2019-06-16"},{"$f":"IF(AJ255>0, IF(AJ255<H255, [1]Sheet1!Q141/L255/M255, 0),0)","v":0},{"$f":"IF(AJ255>0, IF(AJ255>=H255, [1]Sheet1!O141/L255/M255 -S255, 0),0)","v":0},{"$f":" IF(AJ255>H255, [1]Sheet1!Q141/L255/M255, 0)","v":0},null,null,null,null,null,null,33847,1,1,0,0,0,9.4899999999999998E-2]
[{"$f":"[1]Sheet1!A142","v":"Gillies, Laura"},{"$f":"[1]Sheet1!B142","v":"8000232"},{"$f":"[1]Sheet1!C142","v":"f"},{"$f":"[1]Sheet1!D142","v":"1979-02-07"},{"$f":"[1]Sheet1!L142","v":"2012-02-01"},"2099-12-31",null,7,7,0.25,0.25,{"$f":"[1]Sheet1!K142","v":62482},{"$f":"[1]Sheet1!I142","v":1},1,{"$f":"[1]Sheet1!M142","v":"2013-12-24"},{"$f":"[1]Sheet1!R142","v":"2020-12-24"},{"$f":"IF(AJ256>0, IF(AJ256<H256, [1]Sheet1!Q142/L256/M256, 0),0)","v":0},{"$f":"IF(AJ256>0, IF(AJ256>=H256, [1]Sheet1!O142/L256/M256 -S256, 0),0)","v":0},{"$f":" IF(AJ256>H256, [1]Sheet1!Q142/L256/M256, 0)","v":0},null,null,null,null,null,null,33847,1,1,0,0,0,9.4899999999999998E-2]
[{"$f":"[1]Sheet1!A143","v":"Girak, Maria I"},{"$f":"[1]Sheet1!B143","v":"8000233"},{"$f":"[1]Sheet1!C143","v":"f"},{"$f":"[1]Sheet1!D143","v":"1963-09-11"},{"$f":"[1]Sheet1!L143","v":"2002-04-03"},"2099-12-31",null,7,7,0.25,0.25,{"$f":"[1]Sheet1!K143","v":101943},{"$f":"[1]Sheet1!I143","v":1},1,{"$f":"[1]Sheet1!M143","v":"2011-05-10"},{"$f":"[1]Sheet1!R143","v":"2018-05-10"},{"$f":"IF(AJ257>0, IF(AJ257<H257, [1]Sheet1!Q143/L257/M257, 0),0)","v":0},{"$f":"IF(AJ257>0, IF(AJ257>=H257, [1]Sheet1!O143/L257/M257 -S257, 0),0)","v":0},{"$f":" IF(AJ257>H257, [1]Sheet1!Q143/L257/M257, 0)","v":0},null,null,null,null,null,null,33847,1,1,0,0,0,9.4899999999999998E-2]
[{"$f":"[1]Sheet1!A144","v":"Glynn, Megan J"},{"$f":"[1]Sheet1!B144","v":"8000235"},{"$f":"[1]Sheet1!C144","v":"f"},{"$f":"[1]Sheet1!D144","v":"1974-10-19"},{"$f":"[1]Sheet1!L144","v":"1998-02-09"},"2099-12-31",null,7,7,0.25,0.25,{"$f":"[1]Sheet1!K144","v":93994},{"$f":"[1]Sheet1!I144","v":0.4},0.4,{"$f":"[1]Sheet1!M144","v":"2014-05-28"},{"$f":"[1]Sheet1!R144","v":"2021-05-28"},{"$f":"IF(AJ258>0, IF(AJ258<H258, [1]Sheet1!Q144/L258/M258, 0),0)","v":0},{"$f":"IF(AJ258>0, IF(AJ258>=H258, [1]Sheet1!O144/L258/M258 -S258, 0),0)","v":0},{"$f":" IF(AJ258>H258, [1]Sheet1!Q144/L258/M258, 0)","v":0},null,null,null,null,null,null,33847,1,1,0,0,0,9.4899999999999998E-2]
[{"$f":"[1]Sheet1!A145","v":"Godfrey, Alison M"},{"$f":"[1]Sheet1!B145","v":"8000236"},{"$f":"[1]Sheet1!C145","v":"f"},{"$f":"[1]Sheet1!D145","v":"1961-07-28"},{"$f":"[1]Sheet1!L145","v":"2015-10-14"},"2099-12-31",null,7,7,0.25,0.25,{"$f":"[1]Sheet1!K145","v":75295},{"$f":"[1]Sheet1!I145","v":1},1,{"$f":"[1]Sheet1!M145","v":"2015-12-06"},{"$f":"[1]Sheet1!R145","v":"2022-12-06"},{"$f":"IF(AJ259>0, IF(AJ259<H259, [1]Sheet1!Q145/L259/M259, 0),0)","v":0},{"$f":"IF(AJ259>0, IF(AJ259>=H259, [1]Sheet1!O145/L259/M259 -S259, 0),0)","v":0},{"$f":" IF(AJ259>H259, [1]Sheet1!Q145/L259/M259, 0)","v":0},null,null,null,null,null,null,33847,1,1,0,0,0,9.4899999999999998E-2]
[{"$f":"[1]Sheet1!A146","v":"Godfrey, Felicity E"},{"$f":"[1]Sheet1!B146","v":"8000237"},{"$f":"[1]Sheet1!C146","v":"f"},{"$f":"[1]Sheet1!D146","v":"1979-03-08"},{"$f":"[1]Sheet1!L146","v":"2009-04-29"},"2099-12-31",null,7,7,0.25,0.25,{"$f":"[1]Sheet1!K146","v":87815},{"$f":"[1]Sheet1!I146","v":0.8},0.8,{"$f":"[1]Sheet1!M146","v":"2010-08-04"},{"$f":"[1]Sheet1!R146","v":"2017-08-04"},{"$f":"IF(AJ260>0, IF(AJ260<H260, [1]Sheet1!Q146/L260/M260, 0),0)","v":0},{"$f":"IF(AJ260>0, IF(AJ260>=H260, [1]Sheet1!O146/L260/M260 -S260, 0),0)","v":0},{"$f":" IF(AJ260>H260, [1]Sheet1!Q146/L260/M260, 0)","v":0},null,null,null,null,null,null,33847,1,1,0,0,0,9.4899999999999998E-2]
[{"$f":"[1]Sheet1!A147","v":"Golding, David W"},{"$f":"[1]Sheet1!B147","v":"8000238"},{"$f":"[1]Sheet1!C147","v":"m"},{"$f":"[1]Sheet1!D147","v":"1961-09-24"},{"$f":"[1]Sheet1!L147","v":"2008-02-04"},"2099-12-31",null,7,7,0.25,0.25,{"$f":"[1]Sheet1!K147","v":84599},{"$f":"[1]Sheet1!I147","v":0.33},0.33,{"$f":"[1]Sheet1!M147","v":"2015-05-03"},{"$f":"[1]Sheet1!R147","v":"2022-05-03"},{"$f":"IF(AJ261>0, IF(AJ261<H261, [1]Sheet1!Q147/L261/M261, 0),0)","v":0},{"$f":"IF(AJ261>0, IF(AJ261>=H261, [1]Sheet1!O147/L261/M261 -S261, 0),0)","v":0},{"$f":" IF(AJ261>H261, [1]Sheet1!Q147/L261/M261, 0)","v":0},null,null,null,null,null,null,33847,1,1,0,0,0,9.4899999999999998E-2]
[{"$f":"[1]Sheet1!A148","v":"Gooneratne, Adrian D"},{"$f":"[1]Sheet1!B148","v":"8000243"},{"$f":"[1]Sheet1!C148","v":"m"},{"$f":"[1]Sheet1!D148","v":"1969-02-20"},{"$f":"[1]Sheet1!L148","v":"2012-05-14"},"2099-12-31",null,7,7,0.25,0.25,{"$f":"[1]Sheet1!K148","v":98211},{"$f":"[1]Sheet1!I148","v":1},1,{"$f":"[1]Sheet1!M148","v":"2012-06-16"},{"$f":"[1]Sheet1!R148","v":"2019-06-16"},{"$f":"IF(AJ262>0, IF(AJ262<H262, [1]Sheet1!Q148/L262/M262, 0),0)","v":0},{"$f":"IF(AJ262>0, IF(AJ262>=H262, [1]Sheet1!O148/L262/M262 -S262, 0),0)","v":0},{"$f":" IF(AJ262>H262, [1]Sheet1!Q148/L262/M262, 0)","v":0},null,null,null,null,null,null,33847,1,1,0,0,0,9.4899999999999998E-2]
[{"$f":"[1]Sheet1!A149","v":"Gouws, Cornelia P"},{"$f":"[1]Sheet1!B149","v":"8000244"},{"$f":"[1]Sheet1!C149","v":"f"},{"$f":"[1]Sheet1!D149","v":"1967-12-19"},{"$f":"[1]Sheet1!L149","v":"2015-04-20"},"2099-12-31",null,7,7,0.25,0.25,{"$f":"[1]Sheet1!K149","v":50315},{"$f":"[1]Sheet1!I149","v":0.25},0.25,{"$f":"[1]Sheet1!M149","v":"2015-06-03"},{"$f":"[1]Sheet1!R149","v":"2022-06-03"},{"$f":"IF(AJ263>0, IF(AJ263<H263, [1]Sheet1!Q149/L263/M263, 0),0)","v":0},{"$f":"IF(AJ263>0, IF(AJ263>=H263, [1]Sheet1!O149/L263/M263 -S263, 0),0)","v":0},{"$f":" IF(AJ263>H263, [1]Sheet1!Q149/L263/M263, 0)","v":0},null,null,null,null,null,null,33847,1,1,0,0,0,9.4899999999999998E-2]
[{"$f":"[1]Sheet1!A150","v":"Graham, Sarah J"},{"$f":"[1]Sheet1!B150","v":"8000247"},{"$f":"[1]Sheet1!C150","v":"f"},{"$f":"[1]Sheet1!D150","v":"1987-03-05"},{"$f":"[1]Sheet1!L150","v":"2011-06-11"},"2099-12-31",null,7,7,0.25,0.25,{"$f":"[1]Sheet1!K150","v":62482},{"$f":"[1]Sheet1!I150","v":1},1,{"$f":"[1]Sheet1!M150","v":"2011-10-12"},{"$f":"[1]Sheet1!R150","v":"2018-10-12"},{"$f":"IF(AJ264>0, IF(AJ264<H264, [1]Sheet1!Q150/L264/M264, 0),0)","v":0},{"$f":"IF(AJ264>0, IF(AJ264>=H264, [1]Sheet1!O150/L264/M264 -S264, 0),0)","v":0},{"$f":" IF(AJ264>H264, [1]Sheet1!Q150/L264/M264, 0)","v":0},null,null,null,null,null,null,33847,1,1,0,0,0,9.4899999999999998E-2]
[{"$f":"[1]Sheet1!A151","v":"Gray, Maryke T"},{"$f":"[1]Sheet1!B151","v":"8000250"},{"$f":"[1]Sheet1!C151","v":"f"},{"$f":"[1]Sheet1!D151","v":"1969-03-23"},{"$f":"[1]Sheet1!L151","v":"2014-05-05"},"2099-12-31",null,7,7,0.25,0.25,{"$f":"[1]Sheet1!K151","v":93994},{"$f":"[1]Sheet1!I151","v":1},1,{"$f":"[1]Sheet1!M151","v":"2014-05-28"},{"$f":"[1]Sheet1!R151","v":"2021-05-28"},{"$f":"IF(AJ265>0, IF(AJ265<H265, [1]Sheet1!Q151/L265/M265, 0),0)","v":0},{"$f":"IF(AJ265>0, IF(AJ265>=H265, [1]Sheet1!O151/L265/M265 -S265, 0),0)","v":0},{"$f":" IF(AJ265>H265, [1]Sheet1!Q151/L265/M265, 0)","v":0},null,null,null,null,null,null,33847,1,1,0,0,0,9.4899999999999998E-2]
[{"$f":"[1]Sheet1!A152","v":"Guiloy, Maureen"},{"$f":"[1]Sheet1!B152","v":"8000257"},{"$f":"[1]Sheet1!C152","v":"f"},{"$f":"[1]Sheet1!D152","v":"1982-09-23"},{"$f":"[1]Sheet1!L152","v":"2016-08-01"},"2099-12-31",null,7,7,0.25,0.25,{"$f":"[1]Sheet1!K152","v":59172},{"$f":"[1]Sheet1!I152","v":1},1,{"$f":"[1]Sheet1!M152","v":"2015-03-22"},{"$f":"[1]Sheet1!R152","v":"2022-03-22"},{"$f":"IF(AJ266>0, IF(AJ266<H266, [1]Sheet1!Q152/L266/M266, 0),0)","v":0},{"$f":"IF(AJ266>0, IF(AJ266>=H266, [1]Sheet1!O152/L266/M266 -S266, 0),0)","v":0},{"$f":" IF(AJ266>H266, [1]Sheet1!Q152/L266/M266, 0)","v":0},null,null,null,null,null,null,33847,1,1,0,0,0,9.4899999999999998E-2]
[{"$f":"[1]Sheet1!A153","v":"Gutierrez Serrano, Juan"},{"$f":"[1]Sheet1!B153","v":"8000258"},{"$f":"[1]Sheet1!C153","v":"m"},{"$f":"[1]Sheet1!D153","v":"1975-04-26"},{"$f":"[1]Sheet1!L153","v":"2012-03-06"},"2099-12-31",null,7,7,0.25,0.25,{"$f":"[1]Sheet1!K153","v":93994},{"$f":"[1]Sheet1!I153","v":1},1,{"$f":"[1]Sheet1!M153","v":"2012-04-15"},{"$f":"[1]Sheet1!R153","v":"2019-04-15"},{"$f":"IF(AJ267>0, IF(AJ267<H267, [1]Sheet1!Q153/L267/M267, 0),0)","v":0},{"$f":"IF(AJ267>0, IF(AJ267>=H267, [1]Sheet1!O153/L267/M267 -S267, 0),0)","v":0},{"$f":" IF(AJ267>H267, [1]Sheet1!Q153/L267/M267, 0)","v":0},null,null,null,null,null,null,33847,1,1,0,0,0,9.4899999999999998E-2]
[{"$f":"[1]Sheet1!A154","v":"Hall, Anna L"},{"$f":"[1]Sheet1!B154","v":"8000260"},{"$f":"[1]Sheet1!C154","v":"f"},{"$f":"[1]Sheet1!D154","v":"1960-09-11"},{"$f":"[1]Sheet1!L154","v":"2011-03-18"},"2099-12-31",null,7,7,0.25,0.25,{"$f":"[1]Sheet1!K154","v":98211},{"$f":"[1]Sheet1!I154","v":1},1,{"$f":"[1]Sheet1!M154","v":"2011-04-09"},{"$f":"[1]Sheet1!R154","v":"2018-04-09"},{"$f":"IF(AJ268>0, IF(AJ268<H268, [1]Sheet1!Q154/L268/M268, 0),0)","v":0},{"$f":"IF(AJ268>0, IF(AJ268>=H268, [1]Sheet1!O154/L268/M268 -S268, 0),0)","v":0},{"$f":" IF(AJ268>H268, [1]Sheet1!Q154/L268/M268, 0)","v":0},null,null,null,null,null,null,33847,1,1,0,0,0,9.4899999999999998E-2]
[{"$f":"[1]Sheet1!A155","v":"Hall, Peter M"},{"$f":"[1]Sheet1!B155","v":"8000261"},{"$f":"[1]Sheet1!C155","v":"m"},{"$f":"[1]Sheet1!D155","v":"1951-09-23"},{"$f":"[1]Sheet1!L155","v":"2010-10-18"},"2099-12-31",null,7,7,0.25,0.25,{"$f":"[1]Sheet1!K155","v":103122},{"$f":"[1]Sheet1!I155","v":1},1,{"$f":"[1]Sheet1!M155","v":"2010-11-05"},{"$f":"[1]Sheet1!R155","v":"2017-11-05"},{"$f":"IF(AJ269>0, IF(AJ269<H269, [1]Sheet1!Q155/L269/M269, 0),0)","v":0},{"$f":"IF(AJ269>0, IF(AJ269>=H269, [1]Sheet1!O155/L269/M269 -S269, 0),0)","v":0},{"$f":" IF(AJ269>H269, [1]Sheet1!Q155/L269/M269, 0)","v":0},null,null,null,null,null,null,33847,1,1,0,0,0,9.4899999999999998E-2]
[{"$f":"[1]Sheet1!A156","v":"Hall, Susan N"},{"$f":"[1]Sheet1!B156","v":"8000262"},{"$f":"[1]Sheet1!C156","v":"f"},{"$f":"[1]Sheet1!D156","v":"1963-11-24"},{"$f":"[1]Sheet1!L156","v":"2006-09-12"},"2099-12-31",null,7,7,0.25,0.25,{"$f":"[1]Sheet1!K156","v":98211},{"$f":"[1]Sheet1!I156","v":0.5},0.5,{"$f":"[1]Sheet1!M156","v":"2014-04-27"},{"$f":"[1]Sheet1!R156","v":"2021-04-27"},{"$f":"IF(AJ270>0, IF(AJ270<H270, [1]Sheet1!Q156/L270/M270, 0),0)","v":0},{"$f":"IF(AJ270>0, IF(AJ270>=H270, [1]Sheet1!O156/L270/M270 -S270, 0),0)","v":0},{"$f":" IF(AJ270>H270, [1]Sheet1!Q156/L270/M270, 0)","v":0},null,null,null,null,null,null,33847,1,1,0,0,0,9.4899999999999998E-2]
[{"$f":"[1]Sheet1!A157","v":"Hardy, Louanne M"},{"$f":"[1]Sheet1!B157","v":"8000264"},{"$f":"[1]Sheet1!C157","v":"f"},{"$f":"[1]Sheet1!D157","v":"1968-11-12"},{"$f":"[1]Sheet1!L157","v":"1999-02-15"},"2099-12-31",null,7,7,0.25,0.25,{"$f":"[1]Sheet1!K157","v":103122},{"$f":"[1]Sheet1!I157","v":0.70000000000000007},0.70000000000000007,{"$f":"[1]Sheet1!M157","v":"2010-05-10"},{"$f":"[1]Sheet1!R157","v":"2017-05-10"},{"$f":"IF(AJ271>0, IF(AJ271<H271, [1]Sheet1!Q157/L271/M271, 0),0)","v":0},{"$f":"IF(AJ271>0, IF(AJ271>=H271, [1]Sheet1!O157/L271/M271 -S271, 0),0)","v":0},{"$f":" IF(AJ271>H271, [1]Sheet1!Q157/L271/M271, 0)","v":0},null,null,null,null,null,null,33847,1,1,0,0,0,9.4899999999999998E-2]
[{"$f":"[1]Sheet1!A158","v":"Hart, Josephine P"},{"$f":"[1]Sheet1!B158","v":"8000266"},{"$f":"[1]Sheet1!C158","v":"f"},{"$f":"[1]Sheet1!D158","v":"1953-03-14"},{"$f":"[1]Sheet1!L158","v":"2006-03-07"},"2099-12-31",null,7,7,0.25,0.25,{"$f":"[1]Sheet1!K158","v":101943},{"$f":"[1]Sheet1!I158","v":1},1,{"$f":"[1]Sheet1!M158","v":"2013-08-22"},{"$f":"[1]Sheet1!R158","v":"2020-08-22"},{"$f":"IF(AJ272>0, IF(AJ272<H272, [1]Sheet1!Q158/L272/M272, 0),0)","v":0},{"$f":"IF(AJ272>0, IF(AJ272>=H272, [1]Sheet1!O158/L272/M272 -S272, 0),0)","v":0},{"$f":" IF(AJ272>H272, [1]Sheet1!Q158/L272/M272, 0)","v":0},null,null,null,null,null,null,33847,1,1,0,0,0,9.4899999999999998E-2]
[{"$f":"[1]Sheet1!A159","v":"Harvey, Christine"},{"$f":"[1]Sheet1!B159","v":"8000267"},{"$f":"[1]Sheet1!C159","v":"f"},{"$f":"[1]Sheet1!D159","v":"1988-01-20"},{"$f":"[1]Sheet1!L159","v":"2015-01-27"},"2099-12-31",null,7,7,0.25,0.25,{"$f":"[1]Sheet1!K159","v":78517},{"$f":"[1]Sheet1!I159","v":0.77},0.77,{"$f":"[1]Sheet1!M159","v":"2015-03-03"},{"$f":"[1]Sheet1!R159","v":"2022-03-03"},{"$f":"IF(AJ273>0, IF(AJ273<H273, [1]Sheet1!Q159/L273/M273, 0),0)","v":0},{"$f":"IF(AJ273>0, IF(AJ273>=H273, [1]Sheet1!O159/L273/M273 -S273, 0),0)","v":0},{"$f":" IF(AJ273>H273, [1]Sheet1!Q159/L273/M273, 0)","v":0},null,null,null,null,null,null,33847,1,1,0,0,0,9.4899999999999998E-2]
[{"$f":"[1]Sheet1!A160","v":"Harvey, Michelle P"},{"$f":"[1]Sheet1!B160","v":"8000268"},{"$f":"[1]Sheet1!C160","v":"f"},{"$f":"[1]Sheet1!D160","v":"1978-02-21"},{"$f":"[1]Sheet1!L160","v":"2004-10-18"},"2099-12-31",null,7,7,0.25,0.25,{"$f":"[1]Sheet1!K160","v":80797},{"$f":"[1]Sheet1!I160","v":0.6},0.6,{"$f":"[1]Sheet1!M160","v":"2014-05-28"},{"$f":"[1]Sheet1!R160","v":"2021-05-28"},{"$f":"IF(AJ274>0, IF(AJ274<H274, [1]Sheet1!Q160/L274/M274, 0),0)","v":0},{"$f":"IF(AJ274>0, IF(AJ274>=H274, [1]Sheet1!O160/L274/M274 -S274, 0),0)","v":0},{"$f":" IF(AJ274>H274, [1]Sheet1!Q160/L274/M274, 0)","v":0},null,null,null,null,null,null,33847,1,1,0,0,0,9.4899999999999998E-2]
[{"$f":"[1]Sheet1!A161","v":"Henderson, Danielle W"},{"$f":"[1]Sheet1!B161","v":"8000273"},{"$f":"[1]Sheet1!C161","v":"f"},{"$f":"[1]Sheet1!D161","v":"1976-06-09"},{"$f":"[1]Sheet1!L161","v":"1999-07-19"},"2099-12-31",null,7,7,0.25,0.25,{"$f":"[1]Sheet1!K161","v":111106},{"$f":"[1]Sheet1!I161","v":0.89},0.89,{"$f":"[1]Sheet1!M161","v":"2014-08-29"},{"$f":"[1]Sheet1!R161","v":"2021-08-29"},{"$f":"IF(AJ275>0, IF(AJ275<H275, [1]Sheet1!Q161/L275/M275, 0),0)","v":0},{"$f":"IF(AJ275>0, IF(AJ275>=H275, [1]Sheet1!O161/L275/M275 -S275, 0),0)","v":0},{"$f":" IF(AJ275>H275, [1]Sheet1!Q161/L275/M275, 0)","v":0},null,null,null,null,null,null,33847,1,1,0,0,0,9.4899999999999998E-2]
[{"$f":"[1]Sheet1!A162","v":"Hoare, Daniel W"},{"$f":"[1]Sheet1!B162","v":"8000279"},{"$f":"[1]Sheet1!C162","v":"m"},{"$f":"[1]Sheet1!D162","v":"1981-06-01"},{"$f":"[1]Sheet1!L162","v":"2011-05-23"},"2099-12-31",null,7,7,0.25,0.25,{"$f":"[1]Sheet1!K162","v":64256},{"$f":"[1]Sheet1!I162","v":1},1,{"$f":"[1]Sheet1!M162","v":"2011-06-10"},{"$f":"[1]Sheet1!R162","v":"2018-06-10"},{"$f":"IF(AJ276>0, IF(AJ276<H276, [1]Sheet1!Q162/L276/M276, 0),0)","v":0},{"$f":"IF(AJ276>0, IF(AJ276>=H276, [1]Sheet1!O162/L276/M276 -S276, 0),0)","v":0},{"$f":" IF(AJ276>H276, [1]Sheet1!Q162/L276/M276, 0)","v":0},null,null,null,null,null,null,33847,1,1,0,0,0,9.4899999999999998E-2]
[{"$f":"[1]Sheet1!A163","v":"Hodgson, Warwick"},{"$f":"[1]Sheet1!B163","v":"8000280"},{"$f":"[1]Sheet1!C163","v":"m"},{"$f":"[1]Sheet1!D163","v":"1970-03-05"},{"$f":"[1]Sheet1!L163","v":"2009-07-20"},"2099-12-31",null,7,7,0.25,0.25,{"$f":"[1]Sheet1!K163","v":107041},{"$f":"[1]Sheet1!I163","v":1},1,{"$f":"[1]Sheet1!M163","v":"2016-09-11"},{"$f":"[1]Sheet1!R163","v":"2023-09-11"},{"$f":"IF(AJ277>0, IF(AJ277<H277, [1]Sheet1!Q163/L277/M277, 0),0)","v":0},{"$f":"IF(AJ277>0, IF(AJ277>=H277, [1]Sheet1!O163/L277/M277 -S277, 0),0)","v":0},{"$f":" IF(AJ277>H277, [1]Sheet1!Q163/L277/M277, 0)","v":0},null,null,null,null,null,null,33847,1,1,0,0,0,9.4899999999999998E-2]
[{"$f":"[1]Sheet1!A164","v":"Holder, Cathie"},{"$f":"[1]Sheet1!B164","v":"8000281"},{"$f":"[1]Sheet1!C164","v":"f"},{"$f":"[1]Sheet1!D164","v":"1975-08-05"},{"$f":"[1]Sheet1!L164","v":"2015-03-17"},"2099-12-31",null,7,7,0.25,0.25,{"$f":"[1]Sheet1!K164","v":56355.65},{"$f":"[1]Sheet1!I164","v":1},1,{"$f":"[1]Sheet1!M164","v":"2015-11-15"},{"$f":"[1]Sheet1!R164","v":"2022-11-15"},{"$f":"IF(AJ278>0, IF(AJ278<H278, [1]Sheet1!Q164/L278/M278, 0),0)","v":0},{"$f":"IF(AJ278>0, IF(AJ278>=H278, [1]Sheet1!O164/L278/M278 -S278, 0),0)","v":0},{"$f":" IF(AJ278>H278, [1]Sheet1!Q164/L278/M278, 0)","v":0},null,null,null,null,null,null,33847,1,1,0,0,0,9.4899999999999998E-2]
[{"$f":"[1]Sheet1!A165","v":"Holland, Hayley L"},{"$f":"[1]Sheet1!B165","v":"8000282"},{"$f":"[1]Sheet1!C165","v":"f"},{"$f":"[1]Sheet1!D165","v":"1974-01-25"},{"$f":"[1]Sheet1!L165","v":"2005-04-26"},"2099-12-31",null,7,7,0.25,0.25,{"$f":"[1]Sheet1!K165","v":107041},{"$f":"[1]Sheet1!I165","v":1},1,{"$f":"[1]Sheet1!M165","v":"2013-07-22"},{"$f":"[1]Sheet1!R165","v":"2020-07-22"},{"$f":"IF(AJ279>0, IF(AJ279<H279, [1]Sheet1!Q165/L279/M279, 0),0)","v":0},{"$f":"IF(AJ279>0, IF(AJ279>=H279, [1]Sheet1!O165/L279/M279 -S279, 0),0)","v":0},{"$f":" IF(AJ279>H279, [1]Sheet1!Q165/L279/M279, 0)","v":0},null,null,null,null,null,null,33847,1,1,0,0,0,9.4899999999999998E-2]
[{"$f":"[1]Sheet1!A166","v":"Hope, Selwyn J"},{"$f":"[1]Sheet1!B166","v":"8000284"},{"$f":"[1]Sheet1!C166","v":"m"},{"$f":"[1]Sheet1!D166","v":"1975-08-27"},{"$f":"[1]Sheet1!L166","v":"1999-07-19"},"2099-12-31",null,7,7,0.25,0.25,{"$f":"[1]Sheet1!K166","v":98211},{"$f":"[1]Sheet1!I166","v":1},1,{"$f":"[1]Sheet1!M166","v":"2014-08-29"},{"$f":"[1]Sheet1!R166","v":"2021-08-29"},{"$f":"IF(AJ280>0, IF(AJ280<H280, [1]Sheet1!Q166/L280/M280, 0),0)","v":0},{"$f":"IF(AJ280>0, IF(AJ280>=H280, [1]Sheet1!O166/L280/M280 -S280, 0),0)","v":0},{"$f":" IF(AJ280>H280, [1]Sheet1!Q166/L280/M280, 0)","v":0},null,null,null,null,null,null,33847,1,1,0,0,0,9.4899999999999998E-2]
[{"$f":"[1]Sheet1!A167","v":"Hoult, Roslyn J"},{"$f":"[1]Sheet1!B167","v":"8000285"},{"$f":"[1]Sheet1!C167","v":"f"},{"$f":"[1]Sheet1!D167","v":"1974-12-05"},{"$f":"[1]Sheet1!L167","v":"2008-11-13"},"2099-12-31",null,7,7,0.25,0.25,{"$f":"[1]Sheet1!K167","v":47116.93},{"$f":"[1]Sheet1!I167","v":0.55263157894736858},0.55263157894736858,{"$f":"[1]Sheet1!M167","v":"2011-06-04"},{"$f":"[1]Sheet1!R167","v":"2018-06-04"},{"$f":"IF(AJ281>0, IF(AJ281<H281, [1]Sheet1!Q167/L281/M281, 0),0)","v":0},{"$f":"IF(AJ281>0, IF(AJ281>=H281, [1]Sheet1!O167/L281/M281 -S281, 0),0)","v":0},{"$f":" IF(AJ281>H281, [1]Sheet1!Q167/L281/M281, 0)","v":0},null,null,null,null,null,null,33847,1,1,0,0,0,9.4899999999999998E-2]
[{"$f":"[1]Sheet1!A168","v":"Howard, Susan"},{"$f":"[1]Sheet1!B168","v":"8000288"},{"$f":"[1]Sheet1!C168","v":"f"},{"$f":"[1]Sheet1!D168","v":"1961-02-12"},{"$f":"[1]Sheet1!L168","v":"2011-01-10"},"2099-12-31",null,7,7,0.25,0.25,{"$f":"[1]Sheet1!K168","v":64256},{"$f":"[1]Sheet1!I168","v":1},1,{"$f":"[1]Sheet1!M168","v":"2011-02-06"},{"$f":"[1]Sheet1!R168","v":"2018-02-06"},{"$f":"IF(AJ282>0, IF(AJ282<H282, [1]Sheet1!Q168/L282/M282, 0),0)","v":0},{"$f":"IF(AJ282>0, IF(AJ282>=H282, [1]Sheet1!O168/L282/M282 -S282, 0),0)","v":0},{"$f":" IF(AJ282>H282, [1]Sheet1!Q168/L282/M282, 0)","v":0},null,null,null,null,null,null,33847,1,1,0,0,0,9.4899999999999998E-2]
[{"$f":"[1]Sheet1!A169","v":"Ihanimo, Popoino Z"},{"$f":"[1]Sheet1!B169","v":"8000295"},{"$f":"[1]Sheet1!C169","v":"f"},{"$f":"[1]Sheet1!D169","v":"1981-07-06"},{"$f":"[1]Sheet1!L169","v":"2008-03-10"},"2099-12-31",null,7,7,0.25,0.25,{"$f":"[1]Sheet1!K169","v":57376},{"$f":"[1]Sheet1!I169","v":1},1,{"$f":"[1]Sheet1!M169","v":"2015-12-06"},{"$f":"[1]Sheet1!R169","v":"2022-12-06"},{"$f":"IF(AJ283>0, IF(AJ283<H283, [1]Sheet1!Q169/L283/M283, 0),0)","v":0},{"$f":"IF(AJ283>0, IF(AJ283>=H283, [1]Sheet1!O169/L283/M283 -S283, 0),0)","v":0},{"$f":" IF(AJ283>H283, [1]Sheet1!Q169/L283/M283, 0)","v":0},null,null,null,null,null,null,33847,1,1,0,0,0,9.4899999999999998E-2]
[{"$f":"[1]Sheet1!A170","v":"Isbill, David"},{"$f":"[1]Sheet1!B170","v":"8000296"},{"$f":"[1]Sheet1!C170","v":"m"},{"$f":"[1]Sheet1!D170","v":"1959-03-24"},{"$f":"[1]Sheet1!L170","v":"2012-09-17"},"2099-12-31",null,7,7,0.25,0.25,{"$f":"[1]Sheet1!K170","v":64256},{"$f":"[1]Sheet1!I170","v":1},1,{"$f":"[1]Sheet1!M170","v":"2012-10-18"},{"$f":"[1]Sheet1!R170","v":"2019-10-18"},{"$f":"IF(AJ284>0, IF(AJ284<H284, [1]Sheet1!Q170/L284/M284, 0),0)","v":0},{"$f":"IF(AJ284>0, IF(AJ284>=H284, [1]Sheet1!O170/L284/M284 -S284, 0),0)","v":0},{"$f":" IF(AJ284>H284, [1]Sheet1!Q170/L284/M284, 0)","v":0},null,null,null,null,null,null,33847,1,1,0,0,0,9.4899999999999998E-2]
[{"$f":"[1]Sheet1!A171","v":"Jack, Timothy"},{"$f":"[1]Sheet1!B171","v":"8000297"},{"$f":"[1]Sheet1!C171","v":"m"},{"$f":"[1]Sheet1!D171","v":"1993-05-22"},{"$f":"[1]Sheet1!L171","v":"2015-09-29"},"2099-12-31",null,7,7,0.25,0.25,{"$f":"[1]Sheet1!K171","v":60781},{"$f":"[1]Sheet1!I171","v":1},1,{"$f":"[1]Sheet1!M171","v":"2015-11-05"},{"$f":"[1]Sheet1!R171","v":"2022-11-05"},{"$f":"IF(AJ285>0, IF(AJ285<H285, [1]Sheet1!Q171/L285/M285, 0),0)","v":0},{"$f":"IF(AJ285>0, IF(AJ285>=H285, [1]Sheet1!O171/L285/M285 -S285, 0),0)","v":0},{"$f":" IF(AJ285>H285, [1]Sheet1!Q171/L285/M285, 0)","v":0},null,null,null,null,null,null,33847,1,1,0,0,0,9.4899999999999998E-2]
[{"$f":"[1]Sheet1!A172","v":"James, Alice L"},{"$f":"[1]Sheet1!B172","v":"8000298"},{"$f":"[1]Sheet1!C172","v":"f"},{"$f":"[1]Sheet1!D172","v":"1978-07-10"},{"$f":"[1]Sheet1!L172","v":"2010-10-22"},"2099-12-31",null,7,7,0.25,0.25,{"$f":"[1]Sheet1!K172","v":95709},{"$f":"[1]Sheet1!I172","v":1},1,{"$f":"[1]Sheet1!M172","v":"2011-06-10"},{"$f":"[1]Sheet1!R172","v":"2018-06-10"},{"$f":"IF(AJ286>0, IF(AJ286<H286, [1]Sheet1!Q172/L286/M286, 0),0)","v":0},{"$f":"IF(AJ286>0, IF(AJ286>=H286, [1]Sheet1!O172/L286/M286 -S286, 0),0)","v":0},{"$f":" IF(AJ286>H286, [1]Sheet1!Q172/L286/M286, 0)","v":0},null,null,null,null,null,null,33847,1,1,0,0,0,9.4899999999999998E-2]
[{"$f":"[1]Sheet1!A173","v":"Jaworski, Penelope A"},{"$f":"[1]Sheet1!B173","v":"8000299"},{"$f":"[1]Sheet1!C173","v":"f"},{"$f":"[1]Sheet1!D173","v":"1962-03-09"},{"$f":"[1]Sheet1!L173","v":"2002-06-12"},"2099-12-31",null,7,7,0.25,0.25,{"$f":"[1]Sheet1!K173","v":103122},{"$f":"[1]Sheet1!I173","v":1},1,{"$f":"[1]Sheet1!M173","v":"2016-10-12"},{"$f":"[1]Sheet1!R173","v":"2023-10-12"},{"$f":"IF(AJ287>0, IF(AJ287<H287, [1]Sheet1!Q173/L287/M287, 0),0)","v":0},{"$f":"IF(AJ287>0, IF(AJ287>=H287, [1]Sheet1!O173/L287/M287 -S287, 0),0)","v":0},{"$f":" IF(AJ287>H287, [1]Sheet1!Q173/L287/M287, 0)","v":0},null,null,null,null,null,null,33847,1,1,0,0,0,9.4899999999999998E-2]
[{"$f":"[1]Sheet1!A174","v":"Jenkin, Robyn"},{"$f":"[1]Sheet1!B174","v":"8000301"},{"$f":"[1]Sheet1!C174","v":"f"},{"$f":"[1]Sheet1!D174","v":"1972-11-13"},{"$f":"[1]Sheet1!L174","v":"2012-07-23"},"2099-12-31",null,7,7,0.25,0.25,{"$f":"[1]Sheet1!K174","v":88830},{"$f":"[1]Sheet1!I174","v":1},1,{"$f":"[1]Sheet1!M174","v":"2012-07-17"},{"$f":"[1]Sheet1!R174","v":"2019-07-17"},{"$f":"IF(AJ288>0, IF(AJ288<H288, [1]Sheet1!Q174/L288/M288, 0),0)","v":0},{"$f":"IF(AJ288>0, IF(AJ288>=H288, [1]Sheet1!O174/L288/M288 -S288, 0),0)","v":0},{"$f":" IF(AJ288>H288, [1]Sheet1!Q174/L288/M288, 0)","v":0},null,null,null,null,null,null,33847,1,1,0,0,0,9.4899999999999998E-2]
[{"$f":"[1]Sheet1!A175","v":"Jerrard, Craig A"},{"$f":"[1]Sheet1!B175","v":"8000302"},{"$f":"[1]Sheet1!C175","v":"m"},{"$f":"[1]Sheet1!D175","v":"1973-05-04"},{"$f":"[1]Sheet1!L175","v":"2003-01-13"},"2099-12-31",null,7,7,0.25,0.25,{"$f":"[1]Sheet1!K175","v":109590},{"$f":"[1]Sheet1!I175","v":1},1,{"$f":"[1]Sheet1!M175","v":"2014-07-19"},{"$f":"[1]Sheet1!R175","v":"2021-07-19"},{"$f":"IF(AJ289>0, IF(AJ289<H289, [1]Sheet1!Q175/L289/M289, 0),0)","v":0},{"$f":"IF(AJ289>0, IF(AJ289>=H289, [1]Sheet1!O175/L289/M289 -S289, 0),0)","v":0},{"$f":" IF(AJ289>H289, [1]Sheet1!Q175/L289/M289, 0)","v":0},null,null,null,null,null,null,33847,1,1,0,0,0,9.4899999999999998E-2]
[{"$f":"[1]Sheet1!A176","v":"Job, Suresh"},{"$f":"[1]Sheet1!B176","v":"8000303"},{"$f":"[1]Sheet1!C176","v":"m"},{"$f":"[1]Sheet1!D176","v":"1966-10-21"},{"$f":"[1]Sheet1!L176","v":"2009-02-02"},"2099-12-31",null,7,7,0.25,0.25,{"$f":"[1]Sheet1!K176","v":124033},{"$f":"[1]Sheet1!I176","v":1},1,{"$f":"[1]Sheet1!M176","v":"2013-02-19"},{"$f":"[1]Sheet1!R176","v":"2020-02-19"},{"$f":"IF(AJ290>0, IF(AJ290<H290, [1]Sheet1!Q176/L290/M290, 0),0)","v":0},{"$f":"IF(AJ290>0, IF(AJ290>=H290, [1]Sheet1!O176/L290/M290 -S290, 0),0)","v":0},{"$f":" IF(AJ290>H290, [1]Sheet1!Q176/L290/M290, 0)","v":0},null,null,null,null,null,null,33847,1,1,0,0,0,9.4899999999999998E-2]
[{"$f":"[1]Sheet1!A177","v":"Johnson, Colin C L"},{"$f":"[1]Sheet1!B177","v":"8000304"},{"$f":"[1]Sheet1!C177","v":"m"},{"$f":"[1]Sheet1!D177","v":"1975-04-14"},{"$f":"[1]Sheet1!L177","v":"2010-02-01"},"2099-12-31",null,7,7,0.25,0.25,{"$f":"[1]Sheet1!K177","v":90896},{"$f":"[1]Sheet1!I177","v":1},1,{"$f":"[1]Sheet1!M177","v":"2010-01-30"},{"$f":"[1]Sheet1!R177","v":"2017-01-30"},{"$f":"IF(AJ291>0, IF(AJ291<H291, [1]Sheet1!Q177/L291/M291, 0),0)","v":0},{"$f":"IF(AJ291>0, IF(AJ291>=H291, [1]Sheet1!O177/L291/M291 -S291, 0),0)","v":0},{"$f":" IF(AJ291>H291, [1]Sheet1!Q177/L291/M291, 0)","v":0},null,null,null,null,null,null,33847,1,1,0,0,0,9.4899999999999998E-2]
[{"$f":"[1]Sheet1!A178","v":"Jordan, Sharleen L"},{"$f":"[1]Sheet1!B178","v":"8000305"},{"$f":"[1]Sheet1!C178","v":"f"},{"$f":"[1]Sheet1!D178","v":"1967-02-23"},{"$f":"[1]Sheet1!L178","v":"1996-05-03"},"2099-12-31",null,7,7,0.25,0.25,{"$f":"[1]Sheet1!K178","v":111106},{"$f":"[1]Sheet1!I178","v":1},1,{"$f":"[1]Sheet1!M178","v":"2010-11-05"},{"$f":"[1]Sheet1!R178","v":"2017-11-05"},{"$f":"IF(AJ292>0, IF(AJ292<H292, [1]Sheet1!Q178/L292/M292, 0),0)","v":0},{"$f":"IF(AJ292>0, IF(AJ292>=H292, [1]Sheet1!O178/L292/M292 -S292, 0),0)","v":0},{"$f":" IF(AJ292>H292, [1]Sheet1!Q178/L292/M292, 0)","v":0},null,null,null,null,null,null,33847,1,1,0,0,0,9.4899999999999998E-2]
[{"$f":"[1]Sheet1!A179","v":"Jordan, Suzanne E"},{"$f":"[1]Sheet1!B179","v":"8000306"},{"$f":"[1]Sheet1!C179","v":"f"},{"$f":"[1]Sheet1!D179","v":"1971-02-02"},{"$f":"[1]Sheet1!L179","v":"2012-05-01"},"2099-12-31",null,7,7,0.25,0.25,{"$f":"[1]Sheet1!K179","v":98211},{"$f":"[1]Sheet1!I179","v":0.4},0.4,{"$f":"[1]Sheet1!M179","v":"2014-05-28"},{"$f":"[1]Sheet1!R179","v":"2021-05-28"},{"$f":"IF(AJ293>0, IF(AJ293<H293, [1]Sheet1!Q179/L293/M293, 0),0)","v":0},{"$f":"IF(AJ293>0, IF(AJ293>=H293, [1]Sheet1!O179/L293/M293 -S293, 0),0)","v":0},{"$f":" IF(AJ293>H293, [1]Sheet1!Q179/L293/M293, 0)","v":0},null,null,null,null,null,null,33847,1,1,0,0,0,9.4899999999999998E-2]
[{"$f":"[1]Sheet1!A180","v":"Jory, Cara L"},{"$f":"[1]Sheet1!B180","v":"8000307"},{"$f":"[1]Sheet1!C180","v":"f"},{"$f":"[1]Sheet1!D180","v":"1985-04-16"},{"$f":"[1]Sheet1!L180","v":"2011-01-01"},"2099-12-31",null,7,7,0.25,0.25,{"$f":"[1]Sheet1!K180","v":84599},{"$f":"[1]Sheet1!I180","v":1},1,{"$f":"[1]Sheet1!M180","v":"2011-10-12"},{"$f":"[1]Sheet1!R180","v":"2018-10-12"},{"$f":"IF(AJ294>0, IF(AJ294<H294, [1]Sheet1!Q180/L294/M294, 0),0)","v":0},{"$f":"IF(AJ294>0, IF(AJ294>=H294, [1]Sheet1!O180/L294/M294 -S294, 0),0)","v":0},{"$f":" IF(AJ294>H294, [1]Sheet1!Q180/L294/M294, 0)","v":0},null,null,null,null,null,null,33847,1,1,0,0,0,9.4899999999999998E-2]
[{"$f":"[1]Sheet1!A181","v":"Jupp, Sharon G"},{"$f":"[1]Sheet1!B181","v":"8000308"},{"$f":"[1]Sheet1!C181","v":"f"},{"$f":"[1]Sheet1!D181","v":"1973-07-18"},{"$f":"[1]Sheet1!L181","v":"1996-07-22"},"2099-12-31",null,7,7,0.25,0.25,{"$f":"[1]Sheet1!K181","v":109838},{"$f":"[1]Sheet1!I181","v":1},1,{"$f":"[1]Sheet1!M181","v":"2014-08-29"},{"$f":"[1]Sheet1!R181","v":"2021-08-29"},{"$f":"IF(AJ295>0, IF(AJ295<H295, [1]Sheet1!Q181/L295/M295, 0),0)","v":0},{"$f":"IF(AJ295>0, IF(AJ295>=H295, [1]Sheet1!O181/L295/M295 -S295, 0),0)","v":0},{"$f":" IF(AJ295>H295, [1]Sheet1!Q181/L295/M295, 0)","v":0},null,null,null,null,null,null,33847,1,1,0,0,0,9.4899999999999998E-2]
[{"$f":"[1]Sheet1!A182","v":"Kail, Jessica"},{"$f":"[1]Sheet1!B182","v":"8000309"},{"$f":"[1]Sheet1!C182","v":"f"},{"$f":"[1]Sheet1!D182","v":"1972-06-07"},{"$f":"[1]Sheet1!L182","v":"2013-10-01"},"2099-12-31",null,7,7,0.25,0.25,{"$f":"[1]Sheet1!K182","v":91152},{"$f":"[1]Sheet1!I182","v":1},1,{"$f":"[1]Sheet1!M182","v":"2014-02-24"},{"$f":"[1]Sheet1!R182","v":"2021-02-24"},{"$f":"IF(AJ296>0, IF(AJ296<H296, [1]Sheet1!Q182/L296/M296, 0),0)","v":0},{"$f":"IF(AJ296>0, IF(AJ296>=H296, [1]Sheet1!O182/L296/M296 -S296, 0),0)","v":0},{"$f":" IF(AJ296>H296, [1]Sheet1!Q182/L296/M296, 0)","v":0},null,null,null,null,null,null,33847,1,1,0,0,0,9.4899999999999998E-2]
[{"$f":"[1]Sheet1!A183","v":"Kalat, Siti M"},{"$f":"[1]Sheet1!B183","v":"8000310"},{"$f":"[1]Sheet1!C183","v":"f"},{"$f":"[1]Sheet1!D183","v":"1978-09-22"},{"$f":"[1]Sheet1!L183","v":"2004-01-13"},"2099-12-31",null,7,7,0.25,0.25,{"$f":"[1]Sheet1!K183","v":64256},{"$f":"[1]Sheet1!I183","v":0.5},0.5,{"$f":"[1]Sheet1!M183","v":"2013-11-23"},{"$f":"[1]Sheet1!R183","v":"2020-11-23"},{"$f":"IF(AJ297>0, IF(AJ297<H297, [1]Sheet1!Q183/L297/M297, 0),0)","v":0},{"$f":"IF(AJ297>0, IF(AJ297>=H297, [1]Sheet1!O183/L297/M297 -S297, 0),0)","v":0},{"$f":" IF(AJ297>H297, [1]Sheet1!Q183/L297/M297, 0)","v":0},null,null,null,null,null,null,33847,1,1,0,0,0,9.4899999999999998E-2]
[{"$f":"[1]Sheet1!A184","v":"Keeris, Donna M"},{"$f":"[1]Sheet1!B184","v":"8000313"},{"$f":"[1]Sheet1!C184","v":"f"},{"$f":"[1]Sheet1!D184","v":"1969-01-19"},{"$f":"[1]Sheet1!L184","v":"2001-02-12"},"2099-12-31",null,7,7,0.25,0.25,{"$f":"[1]Sheet1!K184","v":57376},{"$f":"[1]Sheet1!I184","v":0.5},0.5,{"$f":"[1]Sheet1!M184","v":"2015-08-04"},{"$f":"[1]Sheet1!R184","v":"2022-08-04"},{"$f":"IF(AJ298>0, IF(AJ298<H298, [1]Sheet1!Q184/L298/M298, 0),0)","v":0},{"$f":"IF(AJ298>0, IF(AJ298>=H298, [1]Sheet1!O184/L298/M298 -S298, 0),0)","v":0},{"$f":" IF(AJ298>H298, [1]Sheet1!Q184/L298/M298, 0)","v":0},null,null,null,null,null,null,33847,1,1,0,0,0,9.4899999999999998E-2]
[{"$f":"[1]Sheet1!A185","v":"Kelly, Elizabeth"},{"$f":"[1]Sheet1!B185","v":"8000314"},{"$f":"[1]Sheet1!C185","v":"f"},{"$f":"[1]Sheet1!D185","v":"1979-09-06"},{"$f":"[1]Sheet1!L185","v":"2009-01-12"},"2099-12-31",null,7,7,0.25,0.25,{"$f":"[1]Sheet1!K185","v":73717},{"$f":"[1]Sheet1!I185","v":1},1,{"$f":"[1]Sheet1!M185","v":"2016-11-12"},{"$f":"[1]Sheet1!R185","v":"2023-11-12"},{"$f":"IF(AJ299>0, IF(AJ299<H299, [1]Sheet1!Q185/L299/M299, 0),0)","v":0},{"$f":"IF(AJ299>0, IF(AJ299>=H299, [1]Sheet1!O185/L299/M299 -S299, 0),0)","v":0},{"$f":" IF(AJ299>H299, [1]Sheet1!Q185/L299/M299, 0)","v":0},null,null,null,null,null,null,33847,1,1,0,0,0,9.4899999999999998E-2]
[{"$f":"[1]Sheet1!A186","v":"Kelly, Stephanie"},{"$f":"[1]Sheet1!B186","v":"8000315"},{"$f":"[1]Sheet1!C186","v":"f"},{"$f":"[1]Sheet1!D186","v":"1963-11-14"},{"$f":"[1]Sheet1!L186","v":"2012-01-23"},"2099-12-31",null,7,7,0.25,0.25,{"$f":"[1]Sheet1!K186","v":92205},{"$f":"[1]Sheet1!I186","v":1},1,{"$f":"[1]Sheet1!M186","v":"2012-02-12"},{"$f":"[1]Sheet1!R186","v":"2019-02-12"},{"$f":"IF(AJ300>0, IF(AJ300<H300, [1]Sheet1!Q186/L300/M300, 0),0)","v":0},{"$f":"IF(AJ300>0, IF(AJ300>=H300, [1]Sheet1!O186/L300/M300 -S300, 0),0)","v":0},{"$f":" IF(AJ300>H300, [1]Sheet1!Q186/L300/M300, 0)","v":0},null,null,null,null,null,null,33847,1,1,0,0,0,9.4899999999999998E-2]
[{"$f":"[1]Sheet1!A187","v":"Kelly, Suellen M"},{"$f":"[1]Sheet1!B187","v":"8000316"},{"$f":"[1]Sheet1!C187","v":"f"},{"$f":"[1]Sheet1!D187","v":"1971-03-17"},{"$f":"[1]Sheet1!L187","v":"2008-10-26"},"2099-12-31",null,7,7,0.25,0.25,{"$f":"[1]Sheet1!K187","v":85577},{"$f":"[1]Sheet1!I187","v":0.8},0.8,{"$f":"[1]Sheet1!M187","v":"2016-02-06"},{"$f":"[1]Sheet1!R187","v":"2023-02-06"},{"$f":"IF(AJ301>0, IF(AJ301<H301, [1]Sheet1!Q187/L301/M301, 0),0)","v":0},{"$f":"IF(AJ301>0, IF(AJ301>=H301, [1]Sheet1!O187/L301/M301 -S301, 0),0)","v":0},{"$f":" IF(AJ301>H301, [1]Sheet1!Q187/L301/M301, 0)","v":0},null,null,null,null,null,null,33847,1,1,0,0,0,9.4899999999999998E-2]
[{"$f":"[1]Sheet1!A188","v":"Kevalaitis, Leopold"},{"$f":"[1]Sheet1!B188","v":"8000319"},{"$f":"[1]Sheet1!C188","v":"m"},{"$f":"[1]Sheet1!D188","v":"1951-01-30"},{"$f":"[1]Sheet1!L188","v":"2009-04-27"},"2099-12-31",null,7,7,0.25,0.25,{"$f":"[1]Sheet1!K188","v":92205},{"$f":"[1]Sheet1!I188","v":1},1,{"$f":"[1]Sheet1!M188","v":"2011-02-06"},{"$f":"[1]Sheet1!R188","v":"2018-02-06"},{"$f":"IF(AJ302>0, IF(AJ302<H302, [1]Sheet1!Q188/L302/M302, 0),0)","v":0},{"$f":"IF(AJ302>0, IF(AJ302>=H302, [1]Sheet1!O188/L302/M302 -S302, 0),0)","v":0},{"$f":" IF(AJ302>H302, [1]Sheet1!Q188/L302/M302, 0)","v":0},null,null,null,null,null,null,33847,1,1,0,0,0,9.4899999999999998E-2]
[{"$f":"[1]Sheet1!A189","v":"Kidd, Robyn F"},{"$f":"[1]Sheet1!B189","v":"8000320"},{"$f":"[1]Sheet1!C189","v":"f"},{"$f":"[1]Sheet1!D189","v":"1975-05-09"},{"$f":"[1]Sheet1!L189","v":"2004-03-15"},"2099-12-31",null,7,7,0.25,0.25,{"$f":"[1]Sheet1!K189","v":73717},{"$f":"[1]Sheet1!I189","v":1},1,{"$f":"[1]Sheet1!M189","v":"2011-10-11"},{"$f":"[1]Sheet1!R189","v":"2018-10-11"},{"$f":"IF(AJ303>0, IF(AJ303<H303, [1]Sheet1!Q189/L303/M303, 0),0)","v":0},{"$f":"IF(AJ303>0, IF(AJ303>=H303, [1]Sheet1!O189/L303/M303 -S303, 0),0)","v":0},{"$f":" IF(AJ303>H303, [1]Sheet1!Q189/L303/M303, 0)","v":0},null,null,null,null,null,null,33847,1,1,0,0,0,9.4899999999999998E-2]
[{"$f":"[1]Sheet1!A190","v":"Kidwai, Hashir K"},{"$f":"[1]Sheet1!B190","v":"8000321"},{"$f":"[1]Sheet1!C190","v":"m"},{"$f":"[1]Sheet1!D190","v":"1976-02-06"},{"$f":"[1]Sheet1!L190","v":"2015-08-03"},"2099-12-31",null,7,7,0.25,0.25,{"$f":"[1]Sheet1!K190","v":92205},{"$f":"[1]Sheet1!I190","v":1},1,{"$f":"[1]Sheet1!M190","v":"2015-10-05"},{"$f":"[1]Sheet1!R190","v":"2022-10-05"},{"$f":"IF(AJ304>0, IF(AJ304<H304, [1]Sheet1!Q190/L304/M304, 0),0)","v":0},{"$f":"IF(AJ304>0, IF(AJ304>=H304, [1]Sheet1!O190/L304/M304 -S304, 0),0)","v":0},{"$f":" IF(AJ304>H304, [1]Sheet1!Q190/L304/M304, 0)","v":0},null,null,null,null,null,null,33847,1,1,0,0,0,9.4899999999999998E-2]
[{"$f":"[1]Sheet1!A191","v":"Lansdell, Simone"},{"$f":"[1]Sheet1!B191","v":"8000333"},{"$f":"[1]Sheet1!C191","v":"f"},{"$f":"[1]Sheet1!D191","v":"1977-05-06"},{"$f":"[1]Sheet1!L191","v":"2016-09-28"},"2099-12-31",null,7,7,0.25,0.25,{"$f":"[1]Sheet1!K191","v":78517},{"$f":"[1]Sheet1!I191","v":0.43},0.43,{"$f":"[1]Sheet1!M191","v":"2014-03-27"},{"$f":"[1]Sheet1!R191","v":"2021-03-27"},{"$f":"IF(AJ305>0, IF(AJ305<H305, [1]Sheet1!Q191/L305/M305, 0),0)","v":0},{"$f":"IF(AJ305>0, IF(AJ305>=H305, [1]Sheet1!O191/L305/M305 -S305, 0),0)","v":0},{"$f":" IF(AJ305>H305, [1]Sheet1!Q191/L305/M305, 0)","v":0},null,null,null,null,null,null,33847,1,1,0,0,0,9.4899999999999998E-2]
[{"$f":"[1]Sheet1!A192","v":"Laumaille, Soazig A"},{"$f":"[1]Sheet1!B192","v":"8000334"},{"$f":"[1]Sheet1!C192","v":"f"},{"$f":"[1]Sheet1!D192","v":"1983-09-29"},{"$f":"[1]Sheet1!L192","v":"2011-05-09"},"2099-12-31",null,7,7,0.25,0.25,{"$f":"[1]Sheet1!K192","v":64256},{"$f":"[1]Sheet1!I192","v":0.8},0.8,{"$f":"[1]Sheet1!M192","v":"2011-12-12"},{"$f":"[1]Sheet1!R192","v":"2018-12-12"},{"$f":"IF(AJ306>0, IF(AJ306<H306, [1]Sheet1!Q192/L306/M306, 0),0)","v":0},{"$f":"IF(AJ306>0, IF(AJ306>=H306, [1]Sheet1!O192/L306/M306 -S306, 0),0)","v":0},{"$f":" IF(AJ306>H306, [1]Sheet1!Q192/L306/M306, 0)","v":0},null,null,null,null,null,null,33847,1,1,0,0,0,9.4899999999999998E-2]
[{"$f":"[1]Sheet1!A193","v":"Lauritsen, Martin S"},{"$f":"[1]Sheet1!B193","v":"8000335"},{"$f":"[1]Sheet1!C193","v":"m"},{"$f":"[1]Sheet1!D193","v":"1966-03-01"},{"$f":"[1]Sheet1!L193","v":"1997-10-20"},"2099-12-31",null,7,7,0.25,0.25,{"$f":"[1]Sheet1!K193","v":84599},{"$f":"[1]Sheet1!I193","v":1},1,{"$f":"[1]Sheet1!M193","v":"2013-06-22"},{"$f":"[1]Sheet1!R193","v":"2020-06-22"},{"$f":"IF(AJ307>0, IF(AJ307<H307, [1]Sheet1!Q193/L307/M307, 0),0)","v":0},{"$f":"IF(AJ307>0, IF(AJ307>=H307, [1]Sheet1!O193/L307/M307 -S307, 0),0)","v":0},{"$f":" IF(AJ307>H307, [1]Sheet1!Q193/L307/M307, 0)","v":0},null,null,null,null,null,null,33847,1,1,0,0,0,9.4899999999999998E-2]
[{"$f":"[1]Sheet1!A194","v":"Law, Irene N"},{"$f":"[1]Sheet1!B194","v":"8000336"},{"$f":"[1]Sheet1!C194","v":"f"},{"$f":"[1]Sheet1!D194","v":"1954-06-06"},{"$f":"[1]Sheet1!L194","v":"2011-01-01"},"2099-12-31",null,7,7,0.25,0.25,{"$f":"[1]Sheet1!K194","v":105816},{"$f":"[1]Sheet1!I194","v":1},1,{"$f":"[1]Sheet1!M194","v":"2011-01-06"},{"$f":"[1]Sheet1!R194","v":"2018-01-06"},{"$f":"IF(AJ308>0, IF(AJ308<H308, [1]Sheet1!Q194/L308/M308, 0),0)","v":0},{"$f":"IF(AJ308>0, IF(AJ308>=H308, [1]Sheet1!O194/L308/M308 -S308, 0),0)","v":0},{"$f":" IF(AJ308>H308, [1]Sheet1!Q194/L308/M308, 0)","v":0},null,null,null,null,null,null,33847,1,1,0,0,0,9.4899999999999998E-2]
[{"$f":"[1]Sheet1!A195","v":"Lazenby, Lexie A"},{"$f":"[1]Sheet1!B195","v":"8000337"},{"$f":"[1]Sheet1!C195","v":"f"},{"$f":"[1]Sheet1!D195","v":"1967-12-05"},{"$f":"[1]Sheet1!L195","v":"2008-07-21"},"2099-12-31",null,7,7,0.25,0.25,{"$f":"[1]Sheet1!K195","v":107041},{"$f":"[1]Sheet1!I195","v":1},{"$f":"M309","v":1},{"$f":"[1]Sheet1!M195","v":"2015-10-05"},{"$f":"[1]Sheet1!R195","v":"2022-10-05"},{"$f":"IF(AJ309>0, IF(AJ309<H309, [1]Sheet1!Q195/L309/M309, 0),0)","v":0},{"$f":"IF(AJ309>0, IF(AJ309>=H309, [1]Sheet1!O195/L309/M309 -S309, 0),0)","v":0},{"$f":" IF(AJ309>H309, [1]Sheet1!Q195/L309/M309, 0)","v":0},null,null,null,null,null,null,33847,1,1,0,0,0,9.4899999999999998E-2]
[{"$f":"[1]Sheet1!A196","v":"Lenane, Rosemarie A"},{"$f":"[1]Sheet1!B196","v":"8000339"},{"$f":"[1]Sheet1!C196","v":"f"},{"$f":"[1]Sheet1!D196","v":"1963-09-17"},{"$f":"[1]Sheet1!L196","v":"1995-02-02"},"2099-12-31",null,7,7,0.25,0.25,{"$f":"[1]Sheet1!K196","v":107041},{"$f":"[1]Sheet1!I196","v":1},1,{"$f":"[1]Sheet1!M196","v":"2011-12-12"},{"$f":"[1]Sheet1!R196","v":"2018-12-12"},{"$f":"IF(AJ310>0, IF(AJ310<H310, [1]Sheet1!Q196/L310/M310, 0),0)","v":0},{"$f":"IF(AJ310>0, IF(AJ310>=H310, [1]Sheet1!O196/L310/M310 -S310, 0),0)","v":0},{"$f":" IF(AJ310>H310, [1]Sheet1!Q196/L310/M310, 0)","v":0},null,null,null,null,null,null,33847,1,1,0,0,0,9.4899999999999998E-2]
[{"$f":"[1]Sheet1!A197","v":"Liprino, Rachael"},{"$f":"[1]Sheet1!B197","v":"8000340"},{"$f":"[1]Sheet1!C197","v":"f"},{"$f":"[1]Sheet1!D197","v":"1985-12-12"},{"$f":"[1]Sheet1!L197","v":"2007-05-28"},"2099-12-31",null,7,7,0.25,0.25,{"$f":"[1]Sheet1!K197","v":64256},{"$f":"[1]Sheet1!I197","v":1},1,{"$f":"[1]Sheet1!M197","v":"2017-02-13"},{"$f":"[1]Sheet1!R197","v":"2024-02-13"},{"$f":"IF(AJ311>0, IF(AJ311<H311, [1]Sheet1!Q197/L311/M311, 0),0)","v":0},{"$f":"IF(AJ311>0, IF(AJ311>=H311, [1]Sheet1!O197/L311/M311 -S311, 0),0)","v":0},{"$f":" IF(AJ311>H311, [1]Sheet1!Q197/L311/M311, 0)","v":0},null,null,null,null,null,null,33847,1,1,0,0,0,9.4899999999999998E-2]
[{"$f":"[1]Sheet1!A198","v":"Lock, Barry"},{"$f":"[1]Sheet1!B198","v":"8000341"},{"$f":"[1]Sheet1!C198","v":"m"},{"$f":"[1]Sheet1!D198","v":"1946-02-12"},{"$f":"[1]Sheet1!L198","v":"2014-01-27"},"2099-12-31",null,7,7,0.25,0.25,{"$f":"[1]Sheet1!K198","v":98211},{"$f":"[1]Sheet1!I198","v":1},1,{"$f":"[1]Sheet1!M198","v":"2014-02-24"},{"$f":"[1]Sheet1!R198","v":"2021-02-24"},{"$f":"IF(AJ312>0, IF(AJ312<H312, [1]Sheet1!Q198/L312/M312, 0),0)","v":0},{"$f":"IF(AJ312>0, IF(AJ312>=H312, [1]Sheet1!O198/L312/M312 -S312, 0),0)","v":0},{"$f":" IF(AJ312>H312, [1]Sheet1!Q198/L312/M312, 0)","v":0},null,null,null,null,null,null,33847,1,1,0,0,0,9.4899999999999998E-2]
[{"$f":"[1]Sheet1!A199","v":"Lockwood, Kym M"},{"$f":"[1]Sheet1!B199","v":"8000342"},{"$f":"[1]Sheet1!C199","v":"f"},{"$f":"[1]Sheet1!D199","v":"1959-04-08"},{"$f":"[1]Sheet1!L199","v":"2010-09-14"},"2099-12-31",null,7,7,0.25,0.25,{"$f":"[1]Sheet1!K199","v":64256},{"$f":"[1]Sheet1!I199","v":1},1,{"$f":"[1]Sheet1!M199","v":"2010-10-05"},{"$f":"[1]Sheet1!R199","v":"2017-10-05"},{"$f":"IF(AJ313>0, IF(AJ313<H313, [1]Sheet1!Q199/L313/M313, 0),0)","v":0},{"$f":"IF(AJ313>0, IF(AJ313>=H313, [1]Sheet1!O199/L313/M313 -S313, 0),0)","v":0},{"$f":" IF(AJ313>H313, [1]Sheet1!Q199/L313/M313, 0)","v":0},null,null,null,null,null,null,33847,1,1,0,0,0,9.4899999999999998E-2]
[{"$f":"[1]Sheet1!A200","v":"Looi, Mei"},{"$f":"[1]Sheet1!B200","v":"8000344"},{"$f":"[1]Sheet1!C200","v":"f"},{"$f":"[1]Sheet1!D200","v":"1977-10-30"},{"$f":"[1]Sheet1!L200","v":"2014-02-10"},"2099-12-31",null,7,7,0.25,0.25,{"$f":"[1]Sheet1!K200","v":62482},{"$f":"[1]Sheet1!I200","v":1},1,{"$f":"[1]Sheet1!M200","v":"2014-03-27"},{"$f":"[1]Sheet1!R200","v":"2021-03-27"},{"$f":"IF(AJ314>0, IF(AJ314<H314, [1]Sheet1!Q200/L314/M314, 0),0)","v":0},{"$f":"IF(AJ314>0, IF(AJ314>=H314, [1]Sheet1!O200/L314/M314 -S314, 0),0)","v":0},{"$f":" IF(AJ314>H314, [1]Sheet1!Q200/L314/M314, 0)","v":0},null,null,null,null,null,null,33847,1,1,0,0,0,9.4899999999999998E-2]
[{"$f":"[1]Sheet1!A201","v":"Ludemann, Richard"},{"$f":"[1]Sheet1!B201","v":"8000345"},{"$f":"[1]Sheet1!C201","v":"m"},{"$f":"[1]Sheet1!D201","v":"1962-10-17"},{"$f":"[1]Sheet1!L201","v":"2009-01-01"},"2099-12-31",null,7,7,0.25,0.25,{"$f":"[1]Sheet1!K201","v":101943},{"$f":"[1]Sheet1!I201","v":1},1,{"$f":"[1]Sheet1!M201","v":"2011-04-09"},{"$f":"[1]Sheet1!R201","v":"2018-04-09"},{"$f":"IF(AJ315>0, IF(AJ315<H315, [1]Sheet1!Q201/L315/M315, 0),0)","v":0},{"$f":"IF(AJ315>0, IF(AJ315>=H315, [1]Sheet1!O201/L315/M315 -S315, 0),0)","v":0},{"$f":" IF(AJ315>H315, [1]Sheet1!Q201/L315/M315, 0)","v":0},null,null,null,null,null,null,33847,1,1,0,0,0,9.4899999999999998E-2]
[{"$f":"[1]Sheet1!A202","v":"Lycett, Belinda"},{"$f":"[1]Sheet1!B202","v":"8000346"},{"$f":"[1]Sheet1!C202","v":"f"},{"$f":"[1]Sheet1!D202","v":"1980-02-07"},{"$f":"[1]Sheet1!L202","v":"2014-01-20"},"2099-12-31",null,7,7,0.25,0.25,{"$f":"[1]Sheet1!K202","v":85577},{"$f":"[1]Sheet1!I202","v":1},1,{"$f":"[1]Sheet1!M202","v":"2014-02-24"},{"$f":"[1]Sheet1!R202","v":"2021-02-24"},{"$f":"IF(AJ316>0, IF(AJ316<H316, [1]Sheet1!Q202/L316/M316, 0),0)","v":0},{"$f":"IF(AJ316>0, IF(AJ316>=H316, [1]Sheet1!O202/L316/M316 -S316, 0),0)","v":0},{"$f":" IF(AJ316>H316, [1]Sheet1!Q202/L316/M316, 0)","v":0},null,null,null,null,null,null,33847,1,1,0,0,0,9.4899999999999998E-2]
[{"$f":"[1]Sheet1!A203","v":"MacLeod, Kim D"},{"$f":"[1]Sheet1!B203","v":"8000348"},{"$f":"[1]Sheet1!C203","v":"m"},{"$f":"[1]Sheet1!D203","v":"1956-03-28"},{"$f":"[1]Sheet1!L203","v":"2001-07-18"},"2099-12-31",null,7,7,0.25,0.25,{"$f":"[1]Sheet1!K203","v":124033},{"$f":"[1]Sheet1!I203","v":1},1,{"$f":"[1]Sheet1!M203","v":"2015-12-06"},{"$f":"[1]Sheet1!R203","v":"2022-12-06"},{"$f":"IF(AJ317>0, IF(AJ317<H317, [1]Sheet1!Q203/L317/M317, 0),0)","v":0},{"$f":"IF(AJ317>0, IF(AJ317>=H317, [1]Sheet1!O203/L317/M317 -S317, 0),0)","v":0},{"$f":" IF(AJ317>H317, [1]Sheet1!Q203/L317/M317, 0)","v":0},null,null,null,null,null,null,33847,1,1,0,0,0,9.4899999999999998E-2]
[{"$f":"[1]Sheet1!A204","v":"Macqueen, Jennifer"},{"$f":"[1]Sheet1!B204","v":"8000349"},{"$f":"[1]Sheet1!C204","v":"f"},{"$f":"[1]Sheet1!D204","v":"1983-06-28"},{"$f":"[1]Sheet1!L204","v":"2016-07-01"},"2099-12-31",null,7,7,0.25,0.25,{"$f":"[1]Sheet1!K204","v":80797},{"$f":"[1]Sheet1!I204","v":1},1,{"$f":"[1]Sheet1!M204","v":"2013-05-22"},{"$f":"[1]Sheet1!R204","v":"2020-05-22"},{"$f":"IF(AJ318>0, IF(AJ318<H318, [1]Sheet1!Q204/L318/M318, 0),0)","v":0},{"$f":"IF(AJ318>0, IF(AJ318>=H318, [1]Sheet1!O204/L318/M318 -S318, 0),0)","v":0},{"$f":" IF(AJ318>H318, [1]Sheet1!Q204/L318/M318, 0)","v":0},null,null,null,null,null,null,33847,1,1,0,0,0,9.4899999999999998E-2]
[{"$f":"[1]Sheet1!A205","v":"Maitre, Tami L"},{"$f":"[1]Sheet1!B205","v":"8000350"},{"$f":"[1]Sheet1!C205","v":"f"},{"$f":"[1]Sheet1!D205","v":"1970-05-25"},{"$f":"[1]Sheet1!L205","v":"2013-07-29"},"2099-12-31",null,7,7,0.25,0.25,{"$f":"[1]Sheet1!K205","v":124033},{"$f":"[1]Sheet1!I205","v":1},1,{"$f":"[1]Sheet1!M205","v":"2010-05-03"},{"$f":"[1]Sheet1!R205","v":"2017-05-03"},{"$f":"IF(AJ319>0, IF(AJ319<H319, [1]Sheet1!Q205/L319/M319, 0),0)","v":0},{"$f":"IF(AJ319>0, IF(AJ319>=H319, [1]Sheet1!O205/L319/M319 -S319, 0),0)","v":0},{"$f":" IF(AJ319>H319, [1]Sheet1!Q205/L319/M319, 0)","v":0},null,null,null,null,null,null,33847,1,1,0,0,0,9.4899999999999998E-2]
[{"$f":"[1]Sheet1!A206","v":"Mao Cheia, Tony G"},{"$f":"[1]Sheet1!B206","v":"8000353"},{"$f":"[1]Sheet1!C206","v":"m"},{"$f":"[1]Sheet1!D206","v":"1977-08-01"},{"$f":"[1]Sheet1!L206","v":"1998-08-24"},"2099-12-31",null,7,7,0.25,0.25,{"$f":"[1]Sheet1!K206","v":73717},{"$f":"[1]Sheet1!I206","v":1},1,{"$f":"[1]Sheet1!M206","v":"2013-10-23"},{"$f":"[1]Sheet1!R206","v":"2020-10-23"},{"$f":"IF(AJ320>0, IF(AJ320<H320, [1]Sheet1!Q206/L320/M320, 0),0)","v":0},{"$f":"IF(AJ320>0, IF(AJ320>=H320, [1]Sheet1!O206/L320/M320 -S320, 0),0)","v":0},{"$f":" IF(AJ320>H320, [1]Sheet1!Q206/L320/M320, 0)","v":0},null,null,null,null,null,null,33847,1,1,0,0,0,9.4899999999999998E-2]
[{"$f":"[1]Sheet1!A207","v":"Marshall, Andrew"},{"$f":"[1]Sheet1!B207","v":"8000356"},{"$f":"[1]Sheet1!C207","v":"m"},{"$f":"[1]Sheet1!D207","v":"1958-02-19"},{"$f":"[1]Sheet1!L207","v":"2016-04-26"},"2099-12-31",null,7,7,0.25,0.25,{"$f":"[1]Sheet1!K207","v":98211},{"$f":"[1]Sheet1!I207","v":1},1,{"$f":"[1]Sheet1!M207","v":"2016-12-13"},{"$f":"[1]Sheet1!R207","v":"2023-12-13"},{"$f":"IF(AJ321>0, IF(AJ321<H321, [1]Sheet1!Q207/L321/M321, 0),0)","v":0},{"$f":"IF(AJ321>0, IF(AJ321>=H321, [1]Sheet1!O207/L321/M321 -S321, 0),0)","v":0},{"$f":" IF(AJ321>H321, [1]Sheet1!Q207/L321/M321, 0)","v":0},null,null,null,null,null,null,33847,1,1,0,0,0,9.4899999999999998E-2]
[{"$f":"[1]Sheet1!A208","v":"Martin, Brian L"},{"$f":"[1]Sheet1!B208","v":"8000357"},{"$f":"[1]Sheet1!C208","v":"m"},{"$f":"[1]Sheet1!D208","v":"1958-05-10"},{"$f":"[1]Sheet1!L208","v":"2013-06-04"},"2099-12-31",null,7,7,0.25,0.25,{"$f":"[1]Sheet1!K208","v":64256},{"$f":"[1]Sheet1!I208","v":1},1,{"$f":"[1]Sheet1!M208","v":"2013-07-23"},{"$f":"[1]Sheet1!R208","v":"2020-07-23"},{"$f":"IF(AJ322>0, IF(AJ322<H322, [1]Sheet1!Q208/L322/M322, 0),0)","v":0},{"$f":"IF(AJ322>0, IF(AJ322>=H322, [1]Sheet1!O208/L322/M322 -S322, 0),0)","v":0},{"$f":" IF(AJ322>H322, [1]Sheet1!Q208/L322/M322, 0)","v":0},null,null,null,null,null,null,33847,1,1,0,0,0,9.4899999999999998E-2]
[{"$f":"[1]Sheet1!A209","v":"Martin, Christine A"},{"$f":"[1]Sheet1!B209","v":"8000358"},{"$f":"[1]Sheet1!C209","v":"f"},{"$f":"[1]Sheet1!D209","v":"1952-10-20"},{"$f":"[1]Sheet1!L209","v":"2012-03-26"},"2099-12-31",null,7,7,0.25,0.25,{"$f":"[1]Sheet1!K209","v":92205},{"$f":"[1]Sheet1!I209","v":1},1,{"$f":"[1]Sheet1!M209","v":"2012-04-15"},{"$f":"[1]Sheet1!R209","v":"2019-04-15"},{"$f":"IF(AJ323>0, IF(AJ323<H323, [1]Sheet1!Q209/L323/M323, 0),0)","v":0},{"$f":"IF(AJ323>0, IF(AJ323>=H323, [1]Sheet1!O209/L323/M323 -S323, 0),0)","v":0},{"$f":" IF(AJ323>H323, [1]Sheet1!Q209/L323/M323, 0)","v":0},null,null,null,null,null,null,33847,1,1,0,0,0,9.4899999999999998E-2]
[{"$f":"[1]Sheet1!A210","v":"Martin, Lorraine J"},{"$f":"[1]Sheet1!B210","v":"8000359"},{"$f":"[1]Sheet1!C210","v":"f"},{"$f":"[1]Sheet1!D210","v":"1958-12-18"},{"$f":"[1]Sheet1!L210","v":"2013-09-09"},"2099-12-31",null,7,7,0.25,0.25,{"$f":"[1]Sheet1!K210","v":75295},{"$f":"[1]Sheet1!I210","v":0.4},0.4,{"$f":"[1]Sheet1!M210","v":"2014-03-27"},{"$f":"[1]Sheet1!R210","v":"2021-03-27"},{"$f":"IF(AJ324>0, IF(AJ324<H324, [1]Sheet1!Q210/L324/M324, 0),0)","v":0},{"$f":"IF(AJ324>0, IF(AJ324>=H324, [1]Sheet1!O210/L324/M324 -S324, 0),0)","v":0},{"$f":" IF(AJ324>H324, [1]Sheet1!Q210/L324/M324, 0)","v":0},null,null,null,null,null,null,33847,1,1,0,0,0,9.4899999999999998E-2]
[{"$f":"[1]Sheet1!A211","v":"McAuley, Ross"},{"$f":"[1]Sheet1!B211","v":"8000364"},{"$f":"[1]Sheet1!C211","v":"m"},{"$f":"[1]Sheet1!D211","v":"1952-04-27"},{"$f":"[1]Sheet1!L211","v":"2011-04-01"},"2099-12-31",null,7,7,0.25,0.25,{"$f":"[1]Sheet1!K211","v":103122},{"$f":"[1]Sheet1!I211","v":1},1,{"$f":"[1]Sheet1!M211","v":"2012-12-19"},{"$f":"[1]Sheet1!R211","v":"2019-12-19"},{"$f":"IF(AJ325>0, IF(AJ325<H325, [1]Sheet1!Q211/L325/M325, 0),0)","v":0},{"$f":"IF(AJ325>0, IF(AJ325>=H325, [1]Sheet1!O211/L325/M325 -S325, 0),0)","v":0},{"$f":" IF(AJ325>H325, [1]Sheet1!Q211/L325/M325, 0)","v":0},null,null,null,null,null,null,33847,1,1,0,0,0,9.4899999999999998E-2]
[{"$f":"[1]Sheet1!A212","v":"McAuliffe, Mark"},{"$f":"[1]Sheet1!B212","v":"8000365"},{"$f":"[1]Sheet1!C212","v":"m"},{"$f":"[1]Sheet1!D212","v":"1967-04-20"},{"$f":"[1]Sheet1!L212","v":"2010-07-19"},"2099-12-31",null,7,7,0.25,0.25,{"$f":"[1]Sheet1!K212","v":91152},{"$f":"[1]Sheet1!I212","v":1},1,{"$f":"[1]Sheet1!M212","v":"2012-07-11"},{"$f":"[1]Sheet1!R212","v":"2019-07-11"},{"$f":"IF(AJ326>0, IF(AJ326<H326, [1]Sheet1!Q212/L326/M326, 0),0)","v":0},{"$f":"IF(AJ326>0, IF(AJ326>=H326, [1]Sheet1!O212/L326/M326 -S326, 0),0)","v":0},{"$f":" IF(AJ326>H326, [1]Sheet1!Q212/L326/M326, 0)","v":0},null,null,null,null,null,null,33847,1,1,0,0,0,9.4899999999999998E-2]
[{"$f":"[1]Sheet1!A213","v":"McCaffrey, Robert J"},{"$f":"[1]Sheet1!B213","v":"8000367"},{"$f":"[1]Sheet1!C213","v":"m"},{"$f":"[1]Sheet1!D213","v":"1957-03-18"},{"$f":"[1]Sheet1!L213","v":"2002-05-15"},"2099-12-31",null,7,7,0.25,0.25,{"$f":"[1]Sheet1!K213","v":98211},{"$f":"[1]Sheet1!I213","v":1},1,{"$f":"[1]Sheet1!M213","v":"2016-10-12"},{"$f":"[1]Sheet1!R213","v":"2023-10-12"},{"$f":"IF(AJ327>0, IF(AJ327<H327, [1]Sheet1!Q213/L327/M327, 0),0)","v":0},{"$f":"IF(AJ327>0, IF(AJ327>=H327, [1]Sheet1!O213/L327/M327 -S327, 0),0)","v":0},{"$f":" IF(AJ327>H327, [1]Sheet1!Q213/L327/M327, 0)","v":0},null,null,null,null,null,null,33847,1,1,0,0,0,9.4899999999999998E-2]
[{"$f":"[1]Sheet1!A214","v":"McCagh, Casey"},{"$f":"[1]Sheet1!B214","v":"8000368"},{"$f":"[1]Sheet1!C214","v":"f"},{"$f":"[1]Sheet1!D214","v":"1976-02-19"},{"$f":"[1]Sheet1!L214","v":"2008-07-21"},"2099-12-31",null,7,7,0.25,0.25,{"$f":"[1]Sheet1!K214","v":111106},{"$f":"[1]Sheet1!I214","v":1},1,{"$f":"[1]Sheet1!M214","v":"2015-12-06"},{"$f":"[1]Sheet1!R214","v":"2022-12-06"},{"$f":"IF(AJ328>0, IF(AJ328<H328, [1]Sheet1!Q214/L328/M328, 0),0)","v":0},{"$f":"IF(AJ328>0, IF(AJ328>=H328, [1]Sheet1!O214/L328/M328 -S328, 0),0)","v":0},{"$f":" IF(AJ328>H328, [1]Sheet1!Q214/L328/M328, 0)","v":0},null,null,null,null,null,null,33847,1,1,0,0,0,9.4899999999999998E-2]
[{"$f":"[1]Sheet1!A215","v":"McCagh, Miranda L"},{"$f":"[1]Sheet1!B215","v":"8000369"},{"$f":"[1]Sheet1!C215","v":"f"},{"$f":"[1]Sheet1!D215","v":"1960-03-18"},{"$f":"[1]Sheet1!L215","v":"2010-01-18"},"2099-12-31",null,7,7,0.25,0.25,{"$f":"[1]Sheet1!K215","v":99345},{"$f":"[1]Sheet1!I215","v":1},1,{"$f":"[1]Sheet1!M215","v":"2010-01-30"},{"$f":"[1]Sheet1!R215","v":"2017-01-30"},{"$f":"IF(AJ329>0, IF(AJ329<H329, [1]Sheet1!Q215/L329/M329, 0),0)","v":0},{"$f":"IF(AJ329>0, IF(AJ329>=H329, [1]Sheet1!O215/L329/M329 -S329, 0),0)","v":0},{"$f":" IF(AJ329>H329, [1]Sheet1!Q215/L329/M329, 0)","v":0},null,null,null,null,null,null,33847,1,1,0,0,0,9.4899999999999998E-2]
[{"$f":"[1]Sheet1!A216","v":"McCrory, Kirrily A"},{"$f":"[1]Sheet1!B216","v":"8000370"},{"$f":"[1]Sheet1!C216","v":"f"},{"$f":"[1]Sheet1!D216","v":"1989-06-01"},{"$f":"[1]Sheet1!L216","v":"2015-03-23"},"2099-12-31",null,7,7,0.25,0.25,{"$f":"[1]Sheet1!K216","v":50315},{"$f":"[1]Sheet1!I216","v":0.25},0.25,{"$f":"[1]Sheet1!M216","v":"2015-06-03"},{"$f":"[1]Sheet1!R216","v":"2022-06-03"},{"$f":"IF(AJ330>0, IF(AJ330<H330, [1]Sheet1!Q216/L330/M330, 0),0)","v":0},{"$f":"IF(AJ330>0, IF(AJ330>=H330, [1]Sheet1!O216/L330/M330 -S330, 0),0)","v":0},{"$f":" IF(AJ330>H330, [1]Sheet1!Q216/L330/M330, 0)","v":0},null,null,null,null,null,null,33847,1,1,0,0,0,9.4899999999999998E-2]
[{"$f":"[1]Sheet1!A217","v":"McCrystal, Craig R"},{"$f":"[1]Sheet1!B217","v":"8000371"},{"$f":"[1]Sheet1!C217","v":"m"},{"$f":"[1]Sheet1!D217","v":"1969-02-06"},{"$f":"[1]Sheet1!L217","v":"2012-05-18"},"2099-12-31",null,7,7,0.25,0.25,{"$f":"[1]Sheet1!K217","v":98211},{"$f":"[1]Sheet1!I217","v":1},1,{"$f":"[1]Sheet1!M217","v":"2012-05-16"},{"$f":"[1]Sheet1!R217","v":"2019-05-16"},{"$f":"IF(AJ331>0, IF(AJ331<H331, [1]Sheet1!Q217/L331/M331, 0),0)","v":0},{"$f":"IF(AJ331>0, IF(AJ331>=H331, [1]Sheet1!O217/L331/M331 -S331, 0),0)","v":0},{"$f":" IF(AJ331>H331, [1]Sheet1!Q217/L331/M331, 0)","v":0},null,null,null,null,null,null,33847,1,1,0,0,0,9.4899999999999998E-2]
[{"$f":"[1]Sheet1!A218","v":"McGlew, Peter J"},{"$f":"[1]Sheet1!B218","v":"8000373"},{"$f":"[1]Sheet1!C218","v":"m"},{"$f":"[1]Sheet1!D218","v":"1956-04-02"},{"$f":"[1]Sheet1!L218","v":"2001-07-23"},"2099-12-31",null,7,7,0.25,0.25,{"$f":"[1]Sheet1!K218","v":124033},{"$f":"[1]Sheet1!I218","v":1},1,{"$f":"[1]Sheet1!M218","v":"2015-12-06"},{"$f":"[1]Sheet1!R218","v":"2022-12-06"},{"$f":"IF(AJ332>0, IF(AJ332<H332, [1]Sheet1!Q218/L332/M332, 0),0)","v":0},{"$f":"IF(AJ332>0, IF(AJ332>=H332, [1]Sheet1!O218/L332/M332 -S332, 0),0)","v":0},{"$f":" IF(AJ332>H332, [1]Sheet1!Q218/L332/M332, 0)","v":0},null,null,null,null,null,null,33847,1,1,0,0,0,9.4899999999999998E-2]
[{"$f":"[1]Sheet1!A219","v":"McLean, Lesley D"},{"$f":"[1]Sheet1!B219","v":"8000376"},{"$f":"[1]Sheet1!C219","v":"f"},{"$f":"[1]Sheet1!D219","v":"1953-12-28"},{"$f":"[1]Sheet1!L219","v":"1995-12-04"},"2099-12-31",null,7,7,0.25,0.25,{"$f":"[1]Sheet1!K219","v":57376},{"$f":"[1]Sheet1!I219","v":1},1,{"$f":"[1]Sheet1!M219","v":"2010-10-05"},{"$f":"[1]Sheet1!R219","v":"2017-10-05"},{"$f":"IF(AJ333>0, IF(AJ333<H333, [1]Sheet1!Q219/L333/M333, 0),0)","v":0},{"$f":"IF(AJ333>0, IF(AJ333>=H333, [1]Sheet1!O219/L333/M333 -S333, 0),0)","v":0},{"$f":" IF(AJ333>H333, [1]Sheet1!Q219/L333/M333, 0)","v":0},null,null,null,null,null,null,33847,1,1,0,0,0,9.4899999999999998E-2]
[{"$f":"[1]Sheet1!A220","v":"McMullan, Bernadette"},{"$f":"[1]Sheet1!B220","v":"8000378"},{"$f":"[1]Sheet1!C220","v":"f"},{"$f":"[1]Sheet1!D220","v":"1958-11-19"},{"$f":"[1]Sheet1!L220","v":"2011-08-05"},"2099-12-31",null,7,7,0.25,0.25,{"$f":"[1]Sheet1!K220","v":84599},{"$f":"[1]Sheet1!I220","v":1},1,{"$f":"[1]Sheet1!M220","v":"2011-03-09"},{"$f":"[1]Sheet1!R220","v":"2018-03-09"},{"$f":"IF(AJ334>0, IF(AJ334<H334, [1]Sheet1!Q220/L334/M334, 0),0)","v":0},{"$f":"IF(AJ334>0, IF(AJ334>=H334, [1]Sheet1!O220/L334/M334 -S334, 0),0)","v":0},{"$f":" IF(AJ334>H334, [1]Sheet1!Q220/L334/M334, 0)","v":0},null,null,null,null,null,null,33847,1,1,0,0,0,9.4899999999999998E-2]
[{"$f":"[1]Sheet1!A221","v":"Metzke, Louise A"},{"$f":"[1]Sheet1!B221","v":"8000381"},{"$f":"[1]Sheet1!C221","v":"f"},{"$f":"[1]Sheet1!D221","v":"1965-08-17"},{"$f":"[1]Sheet1!L221","v":"2011-01-01"},"2099-12-31",null,7,7,0.25,0.25,{"$f":"[1]Sheet1!K221","v":93994},{"$f":"[1]Sheet1!I221","v":1},1,{"$f":"[1]Sheet1!M221","v":"2011-01-06"},{"$f":"[1]Sheet1!R221","v":"2018-01-06"},{"$f":"IF(AJ335>0, IF(AJ335<H335, [1]Sheet1!Q221/L335/M335, 0),0)","v":0},{"$f":"IF(AJ335>0, IF(AJ335>=H335, [1]Sheet1!O221/L335/M335 -S335, 0),0)","v":0},{"$f":" IF(AJ335>H335, [1]Sheet1!Q221/L335/M335, 0)","v":0},null,null,null,null,null,null,33847,1,1,0,0,0,9.4899999999999998E-2]
[{"$f":"[1]Sheet1!A222","v":"Monsello, Lisette A"},{"$f":"[1]Sheet1!B222","v":"8000385"},{"$f":"[1]Sheet1!C222","v":"f"},{"$f":"[1]Sheet1!D222","v":"1958-09-22"},{"$f":"[1]Sheet1!L222","v":"2016-01-18"},"2099-12-31",null,7,7,0.25,0.25,{"$f":"[1]Sheet1!K222","v":84599},{"$f":"[1]Sheet1!I222","v":1},1,{"$f":"[1]Sheet1!M222","v":"2016-03-09"},{"$f":"[1]Sheet1!R222","v":"2023-03-09"},{"$f":"IF(AJ336>0, IF(AJ336<H336, [1]Sheet1!Q222/L336/M336, 0),0)","v":0},{"$f":"IF(AJ336>0, IF(AJ336>=H336, [1]Sheet1!O222/L336/M336 -S336, 0),0)","v":0},{"$f":" IF(AJ336>H336, [1]Sheet1!Q222/L336/M336, 0)","v":0},null,null,null,null,null,null,33847,1,1,0,0,0,9.4899999999999998E-2]
[{"$f":"[1]Sheet1!A223","v":"Moore, Karen M"},{"$f":"[1]Sheet1!B223","v":"8000386"},{"$f":"[1]Sheet1!C223","v":"f"},{"$f":"[1]Sheet1!D223","v":"1974-01-15"},{"$f":"[1]Sheet1!L223","v":"2007-01-01"},"2099-12-31",null,7,7,0.25,0.25,{"$f":"[1]Sheet1!K223","v":84599},{"$f":"[1]Sheet1!I223","v":0.48},0.48,{"$f":"[1]Sheet1!M223","v":"2014-09-29"},{"$f":"[1]Sheet1!R223","v":"2021-09-29"},{"$f":"IF(AJ337>0, IF(AJ337<H337, [1]Sheet1!Q223/L337/M337, 0),0)","v":0},{"$f":"IF(AJ337>0, IF(AJ337>=H337, [1]Sheet1!O223/L337/M337 -S337, 0),0)","v":0},{"$f":" IF(AJ337>H337, [1]Sheet1!Q223/L337/M337, 0)","v":0},null,null,null,null,null,null,33847,1,1,0,0,0,9.4899999999999998E-2]
[{"$f":"[1]Sheet1!A224","v":"Moore, Kylie L"},{"$f":"[1]Sheet1!B224","v":"8000387"},{"$f":"[1]Sheet1!C224","v":"f"},{"$f":"[1]Sheet1!D224","v":"1974-05-21"},{"$f":"[1]Sheet1!L224","v":"2015-10-01"},"2099-12-31",null,7,7,0.25,0.25,{"$f":"[1]Sheet1!K224","v":59172},{"$f":"[1]Sheet1!I224","v":1},1,{"$f":"[1]Sheet1!M224","v":"2016-09-11"},{"$f":"[1]Sheet1!R224","v":"2023-09-11"},{"$f":"IF(AJ338>0, IF(AJ338<H338, [1]Sheet1!Q224/L338/M338, 0),0)","v":0},{"$f":"IF(AJ338>0, IF(AJ338>=H338, [1]Sheet1!O224/L338/M338 -S338, 0),0)","v":0},{"$f":" IF(AJ338>H338, [1]Sheet1!Q224/L338/M338, 0)","v":0},null,null,null,null,null,null,33847,1,1,0,0,0,9.4899999999999998E-2]
[{"$f":"[1]Sheet1!A225","v":"Morris, Kim J"},{"$f":"[1]Sheet1!B225","v":"8000388"},{"$f":"[1]Sheet1!C225","v":"m"},{"$f":"[1]Sheet1!D225","v":"1977-09-07"},{"$f":"[1]Sheet1!L225","v":"2010-10-04"},"2099-12-31",null,7,7,0.25,0.25,{"$f":"[1]Sheet1!K225","v":57376},{"$f":"[1]Sheet1!I225","v":0.8},0.8,{"$f":"[1]Sheet1!M225","v":"2011-09-11"},{"$f":"[1]Sheet1!R225","v":"2018-09-11"},{"$f":"IF(AJ339>0, IF(AJ339<H339, [1]Sheet1!Q225/L339/M339, 0),0)","v":0},{"$f":"IF(AJ339>0, IF(AJ339>=H339, [1]Sheet1!O225/L339/M339 -S339, 0),0)","v":0},{"$f":" IF(AJ339>H339, [1]Sheet1!Q225/L339/M339, 0)","v":0},null,null,null,null,null,null,33847,1,1,0,0,0,9.4899999999999998E-2]
[{"$f":"[1]Sheet1!A226","v":"Muller, Julie"},{"$f":"[1]Sheet1!B226","v":"8000390"},{"$f":"[1]Sheet1!C226","v":"f"},{"$f":"[1]Sheet1!D226","v":"1964-08-08"},{"$f":"[1]Sheet1!L226","v":"2007-11-22"},"2099-12-31",null,7,7,0.25,0.25,{"$f":"[1]Sheet1!K226","v":57376},{"$f":"[1]Sheet1!I226","v":1},1,{"$f":"[1]Sheet1!M226","v":"2015-05-03"},{"$f":"[1]Sheet1!R226","v":"2022-05-03"},{"$f":"IF(AJ340>0, IF(AJ340<H340, [1]Sheet1!Q226/L340/M340, 0),0)","v":0},{"$f":"IF(AJ340>0, IF(AJ340>=H340, [1]Sheet1!O226/L340/M340 -S340, 0),0)","v":0},{"$f":" IF(AJ340>H340, [1]Sheet1!Q226/L340/M340, 0)","v":0},null,null,null,null,null,null,33847,1,1,0,0,0,9.4899999999999998E-2]
[{"$f":"[1]Sheet1!A227","v":"Munday, Janet C A"},{"$f":"[1]Sheet1!B227","v":"8000391"},{"$f":"[1]Sheet1!C227","v":"f"},{"$f":"[1]Sheet1!D227","v":"1954-08-25"},{"$f":"[1]Sheet1!L227","v":"2001-07-16"},"2099-12-31",null,7,7,0.25,0.25,{"$f":"[1]Sheet1!K227","v":98211},{"$f":"[1]Sheet1!I227","v":1},1,{"$f":"[1]Sheet1!M227","v":"2016-02-06"},{"$f":"[1]Sheet1!R227","v":"2023-02-06"},{"$f":"IF(AJ341>0, IF(AJ341<H341, [1]Sheet1!Q227/L341/M341, 0),0)","v":0},{"$f":"IF(AJ341>0, IF(AJ341>=H341, [1]Sheet1!O227/L341/M341 -S341, 0),0)","v":0},{"$f":" IF(AJ341>H341, [1]Sheet1!Q227/L341/M341, 0)","v":0},null,null,null,null,null,null,33847,1,1,0,0,0,9.4899999999999998E-2]
[{"$f":"[1]Sheet1!A228","v":"Munez, Carlo"},{"$f":"[1]Sheet1!B228","v":"8000392"},{"$f":"[1]Sheet1!C228","v":"m"},{"$f":"[1]Sheet1!D228","v":"1980-07-20"},{"$f":"[1]Sheet1!L228","v":"2015-08-24"},"2099-12-31",null,7,7,0.25,0.25,{"$f":"[1]Sheet1!K228","v":48139.4},{"$f":"[1]Sheet1!I228","v":0.5},0.5,{"$f":"[1]Sheet1!M228","v":"2016-03-03"},{"$f":"[1]Sheet1!R228","v":"2023-03-03"},{"$f":"IF(AJ342>0, IF(AJ342<H342, [1]Sheet1!Q228/L342/M342, 0),0)","v":0},{"$f":"IF(AJ342>0, IF(AJ342>=H342, [1]Sheet1!O228/L342/M342 -S342, 0),0)","v":0},{"$f":" IF(AJ342>H342, [1]Sheet1!Q228/L342/M342, 0)","v":0},null,null,null,null,null,null,33847,1,1,0,0,0,9.4899999999999998E-2]
[{"$f":"[1]Sheet1!A229","v":"Munro, Sue-Lyn"},{"$f":"[1]Sheet1!B229","v":"8000393"},{"$f":"[1]Sheet1!C229","v":"f"},{"$f":"[1]Sheet1!D229","v":"1978-04-23"},{"$f":"[1]Sheet1!L229","v":"2016-09-05"},"2099-12-31",null,7,7,0.25,0.25,{"$f":"[1]Sheet1!K229","v":72204},{"$f":"[1]Sheet1!I229","v":1},1,{"$f":"[1]Sheet1!M229","v":"2016-11-12"},{"$f":"[1]Sheet1!R229","v":"2023-11-12"},{"$f":"IF(AJ343>0, IF(AJ343<H343, [1]Sheet1!Q229/L343/M343, 0),0)","v":0},{"$f":"IF(AJ343>0, IF(AJ343>=H343, [1]Sheet1!O229/L343/M343 -S343, 0),0)","v":0},{"$f":" IF(AJ343>H343, [1]Sheet1!Q229/L343/M343, 0)","v":0},null,null,null,null,null,null,33847,1,1,0,0,0,9.4899999999999998E-2]
[{"$f":"[1]Sheet1!A230","v":"Murphy, Jason"},{"$f":"[1]Sheet1!B230","v":"8000394"},{"$f":"[1]Sheet1!C230","v":"m"},{"$f":"[1]Sheet1!D230","v":"1974-05-03"},{"$f":"[1]Sheet1!L230","v":"2013-02-18"},"2099-12-31",null,7,7,0.25,0.25,{"$f":"[1]Sheet1!K230","v":98211},{"$f":"[1]Sheet1!I230","v":1},1,{"$f":"[1]Sheet1!M230","v":"2013-03-21"},{"$f":"[1]Sheet1!R230","v":"2020-03-21"},{"$f":"IF(AJ344>0, IF(AJ344<H344, [1]Sheet1!Q230/L344/M344, 0),0)","v":0},{"$f":"IF(AJ344>0, IF(AJ344>=H344, [1]Sheet1!O230/L344/M344 -S344, 0),0)","v":0},{"$f":" IF(AJ344>H344, [1]Sheet1!Q230/L344/M344, 0)","v":0},null,null,null,null,null,null,33847,1,1,0,0,0,9.4899999999999998E-2]
[{"$f":"[1]Sheet1!A231","v":"Murphy, Kathryn E"},{"$f":"[1]Sheet1!B231","v":"8000395"},{"$f":"[1]Sheet1!C231","v":"f"},{"$f":"[1]Sheet1!D231","v":"1987-03-18"},{"$f":"[1]Sheet1!L231","v":"2015-01-14"},"2099-12-31",null,7,7,0.25,0.25,{"$f":"[1]Sheet1!K231","v":55781},{"$f":"[1]Sheet1!I231","v":0.8},0.8,{"$f":"[1]Sheet1!M231","v":"2015-03-03"},{"$f":"[1]Sheet1!R231","v":"2022-03-03"},{"$f":"IF(AJ345>0, IF(AJ345<H345, [1]Sheet1!Q231/L345/M345, 0),0)","v":0},{"$f":"IF(AJ345>0, IF(AJ345>=H345, [1]Sheet1!O231/L345/M345 -S345, 0),0)","v":0},{"$f":" IF(AJ345>H345, [1]Sheet1!Q231/L345/M345, 0)","v":0},null,null,null,null,null,null,33847,1,1,0,0,0,9.4899999999999998E-2]
[{"$f":"[1]Sheet1!A232","v":"Murray, Samantha F"},{"$f":"[1]Sheet1!B232","v":"8000396"},{"$f":"[1]Sheet1!C232","v":"f"},{"$f":"[1]Sheet1!D232","v":"1982-01-28"},{"$f":"[1]Sheet1!L232","v":"2012-01-07"},"2099-12-31",null,7,7,0.25,0.25,{"$f":"[1]Sheet1!K232","v":64256},{"$f":"[1]Sheet1!I232","v":0.73329999999999995},0.73329999999999995,{"$f":"[1]Sheet1!M232","v":"2013-03-21"},{"$f":"[1]Sheet1!R232","v":"2020-03-21"},{"$f":"IF(AJ346>0, IF(AJ346<H346, [1]Sheet1!Q232/L346/M346, 0),0)","v":0},{"$f":"IF(AJ346>0, IF(AJ346>=H346, [1]Sheet1!O232/L346/M346 -S346, 0),0)","v":0},{"$f":" IF(AJ346>H346, [1]Sheet1!Q232/L346/M346, 0)","v":0},null,null,null,null,null,null,33847,1,1,0,0,0,9.4899999999999998E-2]
[{"$f":"[1]Sheet1!A233","v":"Murrell, Sharmela D"},{"$f":"[1]Sheet1!B233","v":"8000398"},{"$f":"[1]Sheet1!C233","v":"f"},{"$f":"[1]Sheet1!D233","v":"1984-09-01"},{"$f":"[1]Sheet1!L233","v":"2014-03-05"},"2099-12-31",null,7,7,0.25,0.25,{"$f":"[1]Sheet1!K233","v":48452.4},{"$f":"[1]Sheet1!I233","v":1},1,{"$f":"[1]Sheet1!M233","v":"2015-02-28"},{"$f":"[1]Sheet1!R233","v":"2022-02-28"},{"$f":"IF(AJ347>0, IF(AJ347<H347, [1]Sheet1!Q233/L347/M347, 0),0)","v":0},{"$f":"IF(AJ347>0, IF(AJ347>=H347, [1]Sheet1!O233/L347/M347 -S347, 0),0)","v":0},{"$f":" IF(AJ347>H347, [1]Sheet1!Q233/L347/M347, 0)","v":0},null,null,null,null,null,null,33847,1,1,0,0,0,9.4899999999999998E-2]
[{"$f":"[1]Sheet1!A234","v":"Narrier, Robyn M"},{"$f":"[1]Sheet1!B234","v":"8000399"},{"$f":"[1]Sheet1!C234","v":"f"},{"$f":"[1]Sheet1!D234","v":"1978-05-06"},{"$f":"[1]Sheet1!L234","v":"2014-04-28"},"2099-12-31",null,7,7,0.25,0.25,{"$f":"[1]Sheet1!K234","v":90896},{"$f":"[1]Sheet1!I234","v":1},1,{"$f":"[1]Sheet1!M234","v":"2013-07-23"},{"$f":"[1]Sheet1!R234","v":"2020-07-23"},{"$f":"IF(AJ348>0, IF(AJ348<H348, [1]Sheet1!Q234/L348/M348, 0),0)","v":0},{"$f":"IF(AJ348>0, IF(AJ348>=H348, [1]Sheet1!O234/L348/M348 -S348, 0),0)","v":0},{"$f":" IF(AJ348>H348, [1]Sheet1!Q234/L348/M348, 0)","v":0},null,null,null,null,null,null,33847,1,1,0,0,0,9.4899999999999998E-2]
[{"$f":"[1]Sheet1!A235","v":"Natkanski, Michelle G"},{"$f":"[1]Sheet1!B235","v":"8000400"},{"$f":"[1]Sheet1!C235","v":"f"},{"$f":"[1]Sheet1!D235","v":"1957-12-16"},{"$f":"[1]Sheet1!L235","v":"2011-11-25"},"2099-12-31",null,7,7,0.25,0.25,{"$f":"[1]Sheet1!K235","v":64256},{"$f":"[1]Sheet1!I235","v":1},1,{"$f":"[1]Sheet1!M235","v":"2012-04-15"},{"$f":"[1]Sheet1!R235","v":"2019-04-15"},{"$f":"IF(AJ349>0, IF(AJ349<H349, [1]Sheet1!Q235/L349/M349, 0),0)","v":0},{"$f":"IF(AJ349>0, IF(AJ349>=H349, [1]Sheet1!O235/L349/M349 -S349, 0),0)","v":0},{"$f":" IF(AJ349>H349, [1]Sheet1!Q235/L349/M349, 0)","v":0},null,null,null,null,null,null,33847,1,1,0,0,0,9.4899999999999998E-2]
[{"$f":"[1]Sheet1!A236","v":"Newman, Andrew"},{"$f":"[1]Sheet1!B236","v":"8000402"},{"$f":"[1]Sheet1!C236","v":"m"},{"$f":"[1]Sheet1!D236","v":"1972-01-04"},{"$f":"[1]Sheet1!L236","v":"2009-01-12"},"2099-12-31",null,7,7,0.25,0.25,{"$f":"[1]Sheet1!K236","v":87815},{"$f":"[1]Sheet1!I236","v":1},1,{"$f":"[1]Sheet1!M236","v":"2016-03-09"},{"$f":"[1]Sheet1!R236","v":"2023-03-09"},{"$f":"IF(AJ350>0, IF(AJ350<H350, [1]Sheet1!Q236/L350/M350, 0),0)","v":0},{"$f":"IF(AJ350>0, IF(AJ350>=H350, [1]Sheet1!O236/L350/M350 -S350, 0),0)","v":0},{"$f":" IF(AJ350>H350, [1]Sheet1!Q236/L350/M350, 0)","v":0},null,null,null,null,null,null,33847,1,1,0,0,0,9.4899999999999998E-2]
[{"$f":"[1]Sheet1!A237","v":"Newman, Belinda A"},{"$f":"[1]Sheet1!B237","v":"8000403"},{"$f":"[1]Sheet1!C237","v":"f"},{"$f":"[1]Sheet1!D237","v":"1972-01-23"},{"$f":"[1]Sheet1!L237","v":"2009-08-28"},"2099-12-31",null,7,7,0.25,0.25,{"$f":"[1]Sheet1!K237","v":64256},{"$f":"[1]Sheet1!I237","v":0.5},0.5,{"$f":"[1]Sheet1!M237","v":"2010-06-03"},{"$f":"[1]Sheet1!R237","v":"2017-06-03"},{"$f":"IF(AJ351>0, IF(AJ351<H351, [1]Sheet1!Q237/L351/M351, 0),0)","v":0},{"$f":"IF(AJ351>0, IF(AJ351>=H351, [1]Sheet1!O237/L351/M351 -S351, 0),0)","v":0},{"$f":" IF(AJ351>H351, [1]Sheet1!Q237/L351/M351, 0)","v":0},null,null,null,null,null,null,33847,1,1,0,0,0,9.4899999999999998E-2]
[{"$f":"[1]Sheet1!A238","v":"Noble, Alison K"},{"$f":"[1]Sheet1!B238","v":"8000409"},{"$f":"[1]Sheet1!C238","v":"f"},{"$f":"[1]Sheet1!D238","v":"1966-10-16"},{"$f":"[1]Sheet1!L238","v":"2008-11-03"},"2099-12-31",null,7,7,0.25,0.25,{"$f":"[1]Sheet1!K238","v":73717},{"$f":"[1]Sheet1!I238","v":1},1,{"$f":"[1]Sheet1!M238","v":"2016-01-06"},{"$f":"[1]Sheet1!R238","v":"2023-01-06"},{"$f":"IF(AJ352>0, IF(AJ352<H352, [1]Sheet1!Q238/L352/M352, 0),0)","v":0},{"$f":"IF(AJ352>0, IF(AJ352>=H352, [1]Sheet1!O238/L352/M352 -S352, 0),0)","v":0},{"$f":" IF(AJ352>H352, [1]Sheet1!Q238/L352/M352, 0)","v":0},null,null,null,null,null,null,33847,1,1,0,0,0,9.4899999999999998E-2]
[{"$f":"[1]Sheet1!A239","v":"Normandale, Mark"},{"$f":"[1]Sheet1!B239","v":"8000410"},{"$f":"[1]Sheet1!C239","v":"m"},{"$f":"[1]Sheet1!D239","v":"1956-05-11"},{"$f":"[1]Sheet1!L239","v":"2011-01-01"},"2099-12-31",null,7,7,0.25,0.25,{"$f":"[1]Sheet1!K239","v":98211},{"$f":"[1]Sheet1!I239","v":1},1,{"$f":"[1]Sheet1!M239","v":"2011-01-06"},{"$f":"[1]Sheet1!R239","v":"2018-01-06"},{"$f":"IF(AJ353>0, IF(AJ353<H353, [1]Sheet1!Q239/L353/M353, 0),0)","v":0},{"$f":"IF(AJ353>0, IF(AJ353>=H353, [1]Sheet1!O239/L353/M353 -S353, 0),0)","v":0},{"$f":" IF(AJ353>H353, [1]Sheet1!Q239/L353/M353, 0)","v":0},null,null,null,null,null,null,33847,1,1,0,0,0,9.4899999999999998E-2]
[{"$f":"[1]Sheet1!A240","v":"Nowak, Virginia A"},{"$f":"[1]Sheet1!B240","v":"8000411"},{"$f":"[1]Sheet1!C240","v":"f"},{"$f":"[1]Sheet1!D240","v":"1974-08-21"},{"$f":"[1]Sheet1!L240","v":"2005-07-13"},"2099-12-31",null,7,7,0.25,0.25,{"$f":"[1]Sheet1!K240","v":73717},{"$f":"[1]Sheet1!I240","v":0.5},0.5,{"$f":"[1]Sheet1!M240","v":"2017-02-13"},{"$f":"[1]Sheet1!R240","v":"2024-02-13"},{"$f":"IF(AJ354>0, IF(AJ354<H354, [1]Sheet1!Q240/L354/M354, 0),0)","v":0},{"$f":"IF(AJ354>0, IF(AJ354>=H354, [1]Sheet1!O240/L354/M354 -S354, 0),0)","v":0},{"$f":" IF(AJ354>H354, [1]Sheet1!Q240/L354/M354, 0)","v":0},null,null,null,null,null,null,33847,1,1,0,0,0,9.4899999999999998E-2]
[{"$f":"[1]Sheet1!A241","v":"Nyathi, Best"},{"$f":"[1]Sheet1!B241","v":"8000412"},{"$f":"[1]Sheet1!C241","v":"m"},{"$f":"[1]Sheet1!D241","v":"1985-03-29"},{"$f":"[1]Sheet1!L241","v":"2016-07-28"},"2099-12-31",null,7,7,0.25,0.25,{"$f":"[1]Sheet1!K241","v":60781},{"$f":"[1]Sheet1!I241","v":1},1,{"$f":"[1]Sheet1!M241","v":"2016-09-11"},{"$f":"[1]Sheet1!R241","v":"2023-09-11"},{"$f":"IF(AJ355>0, IF(AJ355<H355, [1]Sheet1!Q241/L355/M355, 0),0)","v":0},{"$f":"IF(AJ355>0, IF(AJ355>=H355, [1]Sheet1!O241/L355/M355 -S355, 0),0)","v":0},{"$f":" IF(AJ355>H355, [1]Sheet1!Q241/L355/M355, 0)","v":0},null,null,null,null,null,null,33847,1,1,0,0,0,9.4899999999999998E-2]
[{"$f":"[1]Sheet1!A242","v":"Nye, Beverley S"},{"$f":"[1]Sheet1!B242","v":"8000413"},{"$f":"[1]Sheet1!C242","v":"f"},{"$f":"[1]Sheet1!D242","v":"1954-07-18"},{"$f":"[1]Sheet1!L242","v":"1999-03-22"},"2099-12-31",null,7,7,0.25,0.25,{"$f":"[1]Sheet1!K242","v":57376},{"$f":"[1]Sheet1!I242","v":1},1,{"$f":"[1]Sheet1!M242","v":"2014-02-24"},{"$f":"[1]Sheet1!R242","v":"2021-02-24"},{"$f":"IF(AJ356>0, IF(AJ356<H356, [1]Sheet1!Q242/L356/M356, 0),0)","v":0},{"$f":"IF(AJ356>0, IF(AJ356>=H356, [1]Sheet1!O242/L356/M356 -S356, 0),0)","v":0},{"$f":" IF(AJ356>H356, [1]Sheet1!Q242/L356/M356, 0)","v":0},null,null,null,null,null,null,33847,1,1,0,0,0,9.4899999999999998E-2]
[{"$f":"[1]Sheet1!A243","v":"O'Brien, Teresa C"},{"$f":"[1]Sheet1!B243","v":"8000415"},{"$f":"[1]Sheet1!C243","v":"f"},{"$f":"[1]Sheet1!D243","v":"1965-05-05"},{"$f":"[1]Sheet1!L243","v":"1996-07-01"},"2099-12-31",null,7,7,0.25,0.25,{"$f":"[1]Sheet1!K243","v":109838},{"$f":"[1]Sheet1!I243","v":1},1,{"$f":"[1]Sheet1!M243","v":"2013-03-21"},{"$f":"[1]Sheet1!R243","v":"2020-03-21"},{"$f":"IF(AJ357>0, IF(AJ357<H357, [1]Sheet1!Q243/L357/M357, 0),0)","v":0},{"$f":"IF(AJ357>0, IF(AJ357>=H357, [1]Sheet1!O243/L357/M357 -S357, 0),0)","v":0},{"$f":" IF(AJ357>H357, [1]Sheet1!Q243/L357/M357, 0)","v":0},null,null,null,null,null,null,33847,1,1,0,0,0,9.4899999999999998E-2]
[{"$f":"[1]Sheet1!A244","v":"O'Driscoll, Brenden M"},{"$f":"[1]Sheet1!B244","v":"8000419"},{"$f":"[1]Sheet1!C244","v":"m"},{"$f":"[1]Sheet1!D244","v":"1972-01-05"},{"$f":"[1]Sheet1!L244","v":"2016-04-11"},"2099-12-31",null,7,7,0.25,0.25,{"$f":"[1]Sheet1!K244","v":109590},{"$f":"[1]Sheet1!I244","v":1},1,{"$f":"[1]Sheet1!M244","v":"2016-07-11"},{"$f":"[1]Sheet1!R244","v":"2023-07-11"},{"$f":"IF(AJ358>0, IF(AJ358<H358, [1]Sheet1!Q244/L358/M358, 0),0)","v":0},{"$f":"IF(AJ358>0, IF(AJ358>=H358, [1]Sheet1!O244/L358/M358 -S358, 0),0)","v":0},{"$f":" IF(AJ358>H358, [1]Sheet1!Q244/L358/M358, 0)","v":0},null,null,null,null,null,null,33847,1,1,0,0,0,9.4899999999999998E-2]
[{"$f":"[1]Sheet1!A245","v":"Offer, Stephen K"},{"$f":"[1]Sheet1!B245","v":"8000420"},{"$f":"[1]Sheet1!C245","v":"m"},{"$f":"[1]Sheet1!D245","v":"1963-06-08"},{"$f":"[1]Sheet1!L245","v":"2012-07-23"},"2099-12-31",null,7,7,0.25,0.25,{"$f":"[1]Sheet1!K245","v":94614},{"$f":"[1]Sheet1!I245","v":1},1,{"$f":"[1]Sheet1!M245","v":"2012-08-17"},{"$f":"[1]Sheet1!R245","v":"2019-08-17"},{"$f":"IF(AJ359>0, IF(AJ359<H359, [1]Sheet1!Q245/L359/M359, 0),0)","v":0},{"$f":"IF(AJ359>0, IF(AJ359>=H359, [1]Sheet1!O245/L359/M359 -S359, 0),0)","v":0},{"$f":" IF(AJ359>H359, [1]Sheet1!Q245/L359/M359, 0)","v":0},null,null,null,null,null,null,33847,1,1,0,0,0,9.4899999999999998E-2]
[{"$f":"[1]Sheet1!A246","v":"Old, Gillian G"},{"$f":"[1]Sheet1!B246","v":"8000421"},{"$f":"[1]Sheet1!C246","v":"f"},{"$f":"[1]Sheet1!D246","v":"1967-08-20"},{"$f":"[1]Sheet1!L246","v":"2014-02-24"},"2099-12-31",null,7,7,0.25,0.25,{"$f":"[1]Sheet1!K246","v":80797},{"$f":"[1]Sheet1!I246","v":1},1,{"$f":"[1]Sheet1!M246","v":"2013-03-21"},{"$f":"[1]Sheet1!R246","v":"2020-03-21"},{"$f":"IF(AJ360>0, IF(AJ360<H360, [1]Sheet1!Q246/L360/M360, 0),0)","v":0},{"$f":"IF(AJ360>0, IF(AJ360>=H360, [1]Sheet1!O246/L360/M360 -S360, 0),0)","v":0},{"$f":" IF(AJ360>H360, [1]Sheet1!Q246/L360/M360, 0)","v":0},null,null,null,null,null,null,33847,1,1,0,0,0,9.4899999999999998E-2]
[{"$f":"[1]Sheet1!A247","v":"Oliveri, Tracie"},{"$f":"[1]Sheet1!B247","v":"8000422"},{"$f":"[1]Sheet1!C247","v":"f"},{"$f":"[1]Sheet1!D247","v":"1969-09-08"},{"$f":"[1]Sheet1!L247","v":"2008-01-14"},"2099-12-31",null,7,7,0.25,0.25,{"$f":"[1]Sheet1!K247","v":107041},{"$f":"[1]Sheet1!I247","v":1},1,{"$f":"[1]Sheet1!M247","v":"2015-04-03"},{"$f":"[1]Sheet1!R247","v":"2022-04-03"},{"$f":"IF(AJ361>0, IF(AJ361<H361, [1]Sheet1!Q247/L361/M361, 0),0)","v":0},{"$f":"IF(AJ361>0, IF(AJ361>=H361, [1]Sheet1!O247/L361/M361 -S361, 0),0)","v":0},{"$f":" IF(AJ361>H361, [1]Sheet1!Q247/L361/M361, 0)","v":0},null,null,null,null,null,null,33847,1,1,0,0,0,9.4899999999999998E-2]
[{"$f":"[1]Sheet1!A248","v":"O'Malley, Kelly M"},{"$f":"[1]Sheet1!B248","v":"8000424"},{"$f":"[1]Sheet1!C248","v":"f"},{"$f":"[1]Sheet1!D248","v":"1986-07-23"},{"$f":"[1]Sheet1!L248","v":"2009-09-07"},"2099-12-31",null,7,7,0.25,0.25,{"$f":"[1]Sheet1!K248","v":57376},{"$f":"[1]Sheet1!I248","v":1},1,{"$f":"[1]Sheet1!M248","v":"2010-07-04"},{"$f":"[1]Sheet1!R248","v":"2017-07-04"},{"$f":"IF(AJ362>0, IF(AJ362<H362, [1]Sheet1!Q248/L362/M362, 0),0)","v":0},{"$f":"IF(AJ362>0, IF(AJ362>=H362, [1]Sheet1!O248/L362/M362 -S362, 0),0)","v":0},{"$f":" IF(AJ362>H362, [1]Sheet1!Q248/L362/M362, 0)","v":0},null,null,null,null,null,null,33847,1,1,0,0,0,9.4899999999999998E-2]
[{"$f":"[1]Sheet1!A249","v":"O'Moore, James"},{"$f":"[1]Sheet1!B249","v":"8000425"},{"$f":"[1]Sheet1!C249","v":"m"},{"$f":"[1]Sheet1!D249","v":"1970-04-16"},{"$f":"[1]Sheet1!L249","v":"2011-04-04"},"2099-12-31",null,7,7,0.25,0.25,{"$f":"[1]Sheet1!K249","v":93994},{"$f":"[1]Sheet1!I249","v":1},1,{"$f":"[1]Sheet1!M249","v":"2011-05-10"},{"$f":"[1]Sheet1!R249","v":"2018-05-10"},{"$f":"IF(AJ363>0, IF(AJ363<H363, [1]Sheet1!Q249/L363/M363, 0),0)","v":0},{"$f":"IF(AJ363>0, IF(AJ363>=H363, [1]Sheet1!O249/L363/M363 -S363, 0),0)","v":0},{"$f":" IF(AJ363>H363, [1]Sheet1!Q249/L363/M363, 0)","v":0},null,null,null,null,null,null,33847,1,1,0,0,0,9.4899999999999998E-2]
[{"$f":"[1]Sheet1!A250","v":"Papandrea, Elarna"},{"$f":"[1]Sheet1!B250","v":"8000430"},{"$f":"[1]Sheet1!C250","v":"f"},{"$f":"[1]Sheet1!D250","v":"1982-01-05"},{"$f":"[1]Sheet1!L250","v":"2015-06-01"},"2099-12-31",null,7,7,0.25,0.25,{"$f":"[1]Sheet1!K250","v":87815},{"$f":"[1]Sheet1!I250","v":0.6},0.6,{"$f":"[1]Sheet1!M250","v":"2015-09-04"},{"$f":"[1]Sheet1!R250","v":"2022-09-04"},{"$f":"IF(AJ364>0, IF(AJ364<H364, [1]Sheet1!Q250/L364/M364, 0),0)","v":0},{"$f":"IF(AJ364>0, IF(AJ364>=H364, [1]Sheet1!O250/L364/M364 -S364, 0),0)","v":0},{"$f":" IF(AJ364>H364, [1]Sheet1!Q250/L364/M364, 0)","v":0},null,null,null,null,null,null,33847,1,1,0,0,0,9.4899999999999998E-2]
[{"$f":"[1]Sheet1!A251","v":"Patmore, Melba"},{"$f":"[1]Sheet1!B251","v":"8000433"},{"$f":"[1]Sheet1!C251","v":"f"},{"$f":"[1]Sheet1!D251","v":"1966-01-06"},{"$f":"[1]Sheet1!L251","v":"2015-11-02"},"2099-12-31",null,7,7,0.25,0.25,{"$f":"[1]Sheet1!K251","v":60781},{"$f":"[1]Sheet1!I251","v":0.5},0.5,{"$f":"[1]Sheet1!M251","v":"2016-01-06"},{"$f":"[1]Sheet1!R251","v":"2023-01-06"},{"$f":"IF(AJ365>0, IF(AJ365<H365, [1]Sheet1!Q251/L365/M365, 0),0)","v":0},{"$f":"IF(AJ365>0, IF(AJ365>=H365, [1]Sheet1!O251/L365/M365 -S365, 0),0)","v":0},{"$f":" IF(AJ365>H365, [1]Sheet1!Q251/L365/M365, 0)","v":0},null,null,null,null,null,null,33847,1,1,0,0,0,9.4899999999999998E-2]
[{"$f":"[1]Sheet1!A252","v":"Patten, Trista"},{"$f":"[1]Sheet1!B252","v":"8000434"},{"$f":"[1]Sheet1!C252","v":"f"},{"$f":"[1]Sheet1!D252","v":"1975-08-07"},{"$f":"[1]Sheet1!L252","v":"2015-01-19"},"2099-12-31",null,7,7,0.25,0.25,{"$f":"[1]Sheet1!K252","v":78517},{"$f":"[1]Sheet1!I252","v":1},1,{"$f":"[1]Sheet1!M252","v":"2015-03-03"},{"$f":"[1]Sheet1!R252","v":"2022-03-03"},{"$f":"IF(AJ366>0, IF(AJ366<H366, [1]Sheet1!Q252/L366/M366, 0),0)","v":0},{"$f":"IF(AJ366>0, IF(AJ366>=H366, [1]Sheet1!O252/L366/M366 -S366, 0),0)","v":0},{"$f":" IF(AJ366>H366, [1]Sheet1!Q252/L366/M366, 0)","v":0},null,null,null,null,null,null,33847,1,1,0,0,0,9.4899999999999998E-2]
[{"$f":"[1]Sheet1!A253","v":"Paul, Rachel E"},{"$f":"[1]Sheet1!B253","v":"8000435"},{"$f":"[1]Sheet1!C253","v":"f"},{"$f":"[1]Sheet1!D253","v":"1990-10-16"},{"$f":"[1]Sheet1!L253","v":"2011-01-01"},"2099-12-31",null,7,7,0.25,0.25,{"$f":"[1]Sheet1!K253","v":64256},{"$f":"[1]Sheet1!I253","v":1},1,{"$f":"[1]Sheet1!M253","v":"2012-08-17"},{"$f":"[1]Sheet1!R253","v":"2019-08-17"},{"$f":"IF(AJ367>0, IF(AJ367<H367, [1]Sheet1!Q253/L367/M367, 0),0)","v":0},{"$f":"IF(AJ367>0, IF(AJ367>=H367, [1]Sheet1!O253/L367/M367 -S367, 0),0)","v":0},{"$f":" IF(AJ367>H367, [1]Sheet1!Q253/L367/M367, 0)","v":0},null,null,null,null,null,null,33847,1,1,0,0,0,9.4899999999999998E-2]
[{"$f":"[1]Sheet1!A254","v":"Paxman, James D"},{"$f":"[1]Sheet1!B254","v":"8000436"},{"$f":"[1]Sheet1!C254","v":"m"},{"$f":"[1]Sheet1!D254","v":"1979-11-30"},{"$f":"[1]Sheet1!L254","v":"2004-01-27"},"2099-12-31",null,7,7,0.25,0.25,{"$f":"[1]Sheet1!K254","v":105816},{"$f":"[1]Sheet1!I254","v":1},1,{"$f":"[1]Sheet1!M254","v":"2011-04-09"},{"$f":"[1]Sheet1!R254","v":"2018-04-09"},{"$f":"IF(AJ368>0, IF(AJ368<H368, [1]Sheet1!Q254/L368/M368, 0),0)","v":0},{"$f":"IF(AJ368>0, IF(AJ368>=H368, [1]Sheet1!O254/L368/M368 -S368, 0),0)","v":0},{"$f":" IF(AJ368>H368, [1]Sheet1!Q254/L368/M368, 0)","v":0},null,null,null,null,null,null,33847,1,1,0,0,0,9.4899999999999998E-2]
[{"$f":"[1]Sheet1!A255","v":"Paxman, Steven M"},{"$f":"[1]Sheet1!B255","v":"8000437"},{"$f":"[1]Sheet1!C255","v":"m"},{"$f":"[1]Sheet1!D255","v":"1955-06-18"},{"$f":"[1]Sheet1!L255","v":"2005-02-18"},"2099-12-31",null,7,7,0.25,0.25,{"$f":"[1]Sheet1!K255","v":101943},{"$f":"[1]Sheet1!I255","v":1},1,{"$f":"[1]Sheet1!M255","v":"2013-06-22"},{"$f":"[1]Sheet1!R255","v":"2020-06-22"},{"$f":"IF(AJ369>0, IF(AJ369<H369, [1]Sheet1!Q255/L369/M369, 0),0)","v":0},{"$f":"IF(AJ369>0, IF(AJ369>=H369, [1]Sheet1!O255/L369/M369 -S369, 0),0)","v":0},{"$f":" IF(AJ369>H369, [1]Sheet1!Q255/L369/M369, 0)","v":0},null,null,null,null,null,null,33847,1,1,0,0,0,9.4899999999999998E-2]
[{"$f":"[1]Sheet1!A256","v":"Pepper, Natasha"},{"$f":"[1]Sheet1!B256","v":"8000439"},{"$f":"[1]Sheet1!C256","v":"f"},{"$f":"[1]Sheet1!D256","v":"1971-06-23"},{"$f":"[1]Sheet1!L256","v":"2014-07-26"},"2099-12-31",null,7,7,0.25,0.25,{"$f":"[1]Sheet1!K256","v":87815},{"$f":"[1]Sheet1!I256","v":1},1,{"$f":"[1]Sheet1!M256","v":"2014-09-29"},{"$f":"[1]Sheet1!R256","v":"2021-09-29"},{"$f":"IF(AJ370>0, IF(AJ370<H370, [1]Sheet1!Q256/L370/M370, 0),0)","v":0},{"$f":"IF(AJ370>0, IF(AJ370>=H370, [1]Sheet1!O256/L370/M370 -S370, 0),0)","v":0},{"$f":" IF(AJ370>H370, [1]Sheet1!Q256/L370/M370, 0)","v":0},null,null,null,null,null,null,33847,1,1,0,0,0,9.4899999999999998E-2]
[{"$f":"[1]Sheet1!A257","v":"Philippkowski, Ronald"},{"$f":"[1]Sheet1!B257","v":"8000441"},{"$f":"[1]Sheet1!C257","v":"m"},{"$f":"[1]Sheet1!D257","v":"1954-09-24"},{"$f":"[1]Sheet1!L257","v":"2016-01-11"},"2099-12-31",null,7,7,0.25,0.25,{"$f":"[1]Sheet1!K257","v":98211},{"$f":"[1]Sheet1!I257","v":1},1,{"$f":"[1]Sheet1!M257","v":"2016-06-10"},{"$f":"[1]Sheet1!R257","v":"2023-06-10"},{"$f":"IF(AJ371>0, IF(AJ371<H371, [1]Sheet1!Q257/L371/M371, 0),0)","v":0},{"$f":"IF(AJ371>0, IF(AJ371>=H371, [1]Sheet1!O257/L371/M371 -S371, 0),0)","v":0},{"$f":" IF(AJ371>H371, [1]Sheet1!Q257/L371/M371, 0)","v":0},null,null,null,null,null,null,33847,1,1,0,0,0,9.4899999999999998E-2]
[{"$f":"[1]Sheet1!A258","v":"Piazzola, Stephanie R"},{"$f":"[1]Sheet1!B258","v":"8000442"},{"$f":"[1]Sheet1!C258","v":"f"},{"$f":"[1]Sheet1!D258","v":"1958-04-30"},{"$f":"[1]Sheet1!L258","v":"2012-01-23"},"2099-12-31",null,7,7,0.25,0.25,{"$f":"[1]Sheet1!K258","v":53136},{"$f":"[1]Sheet1!I258","v":0.6},0.6,{"$f":"[1]Sheet1!M258","v":"2012-06-16"},{"$f":"[1]Sheet1!R258","v":"2019-06-16"},{"$f":"IF(AJ372>0, IF(AJ372<H372, [1]Sheet1!Q258/L372/M372, 0),0)","v":0},{"$f":"IF(AJ372>0, IF(AJ372>=H372, [1]Sheet1!O258/L372/M372 -S372, 0),0)","v":0},{"$f":" IF(AJ372>H372, [1]Sheet1!Q258/L372/M372, 0)","v":0},null,null,null,null,null,null,33847,1,1,0,0,0,9.4899999999999998E-2]
[{"$f":"[1]Sheet1!A259","v":"Pitt, George R J"},{"$f":"[1]Sheet1!B259","v":"8000443"},{"$f":"[1]Sheet1!C259","v":"m"},{"$f":"[1]Sheet1!D259","v":"1952-09-20"},{"$f":"[1]Sheet1!L259","v":"2007-01-01"},"2099-12-31",null,7,7,0.25,0.25,{"$f":"[1]Sheet1!K259","v":98211},{"$f":"[1]Sheet1!I259","v":1},{"$f":"M373","v":1},{"$f":"[1]Sheet1!M259","v":"2014-08-29"},{"$f":"[1]Sheet1!R259","v":"2021-08-29"},{"$f":"IF(AJ373>0, IF(AJ373<H373, [1]Sheet1!Q259/L373/M373, 0),0)","v":0},{"$f":"IF(AJ373>0, IF(AJ373>=H373, [1]Sheet1!O259/L373/M373 -S373, 0),0)","v":0},{"$f":" IF(AJ373>H373, [1]Sheet1!Q259/L373/M373, 0)","v":0},null,null,null,null,null,null,33847,1,1,0,0,0,9.4899999999999998E-2]
[{"$f":"[1]Sheet1!A260","v":"Plug, Maarten"},{"$f":"[1]Sheet1!B260","v":"8000444"},{"$f":"[1]Sheet1!C260","v":"m"},{"$f":"[1]Sheet1!D260","v":"1961-04-27"},{"$f":"[1]Sheet1!L260","v":"2011-08-20"},"2099-12-31",null,7,7,0.25,0.25,{"$f":"[1]Sheet1!K260","v":88830},{"$f":"[1]Sheet1!I260","v":1},1,{"$f":"[1]Sheet1!M260","v":"2014-03-27"},{"$f":"[1]Sheet1!R260","v":"2021-03-27"},{"$f":"IF(AJ374>0, IF(AJ374<H374, [1]Sheet1!Q260/L374/M374, 0),0)","v":0},{"$f":"IF(AJ374>0, IF(AJ374>=H374, [1]Sheet1!O260/L374/M374 -S374, 0),0)","v":0},{"$f":" IF(AJ374>H374, [1]Sheet1!Q260/L374/M374, 0)","v":0},null,null,null,null,null,null,33847,1,1,0,0,0,9.4899999999999998E-2]
[{"$f":"[1]Sheet1!A261","v":"Praprotnik, Kyle F"},{"$f":"[1]Sheet1!B261","v":"8000449"},{"$f":"[1]Sheet1!C261","v":"m"},{"$f":"[1]Sheet1!D261","v":"1978-05-26"},{"$f":"[1]Sheet1!L261","v":"2011-02-28"},"2099-12-31",null,7,7,0.25,0.25,{"$f":"[1]Sheet1!K261","v":103122},{"$f":"[1]Sheet1!I261","v":1},1,{"$f":"[1]Sheet1!M261","v":"2011-03-09"},{"$f":"[1]Sheet1!R261","v":"2018-03-09"},{"$f":"IF(AJ375>0, IF(AJ375<H375, [1]Sheet1!Q261/L375/M375, 0),0)","v":0},{"$f":"IF(AJ375>0, IF(AJ375>=H375, [1]Sheet1!O261/L375/M375 -S375, 0),0)","v":0},{"$f":" IF(AJ375>H375, [1]Sheet1!Q261/L375/M375, 0)","v":0},null,null,null,null,null,null,33847,1,1,0,0,0,9.4899999999999998E-2]
[{"$f":"[1]Sheet1!A262","v":"Rangila, Rupinder"},{"$f":"[1]Sheet1!B262","v":"8000457"},{"$f":"[1]Sheet1!C262","v":"f"},{"$f":"[1]Sheet1!D262","v":"1979-04-11"},{"$f":"[1]Sheet1!L262","v":"2014-08-20"},"2099-12-31",null,7,7,0.25,0.25,{"$f":"[1]Sheet1!K262","v":62482},{"$f":"[1]Sheet1!I262","v":1},1,{"$f":"[1]Sheet1!M262","v":"2014-09-29"},{"$f":"[1]Sheet1!R262","v":"2021-09-29"},{"$f":"IF(AJ376>0, IF(AJ376<H376, [1]Sheet1!Q262/L376/M376, 0),0)","v":0},{"$f":"IF(AJ376>0, IF(AJ376>=H376, [1]Sheet1!O262/L376/M376 -S376, 0),0)","v":0},{"$f":" IF(AJ376>H376, [1]Sheet1!Q262/L376/M376, 0)","v":0},null,null,null,null,null,null,33847,1,1,0,0,0,9.4899999999999998E-2]
[{"$f":"[1]Sheet1!A263","v":"Rattigan, Francis G"},{"$f":"[1]Sheet1!B263","v":"8000458"},{"$f":"[1]Sheet1!C263","v":"m"},{"$f":"[1]Sheet1!D263","v":"1960-01-29"},{"$f":"[1]Sheet1!L263","v":"2001-03-13"},"2099-12-31",null,7,7,0.25,0.25,{"$f":"[1]Sheet1!K263","v":88830},{"$f":"[1]Sheet1!I263","v":1},1,{"$f":"[1]Sheet1!M263","v":"2015-10-05"},{"$f":"[1]Sheet1!R263","v":"2022-10-05"},{"$f":"IF(AJ377>0, IF(AJ377<H377, [1]Sheet1!Q263/L377/M377, 0),0)","v":0},{"$f":"IF(AJ377>0, IF(AJ377>=H377, [1]Sheet1!O263/L377/M377 -S377, 0),0)","v":0},{"$f":" IF(AJ377>H377, [1]Sheet1!Q263/L377/M377, 0)","v":0},null,null,null,null,null,null,33847,1,1,0,0,0,9.4899999999999998E-2]
[{"$f":"[1]Sheet1!A264","v":"Rayner, Gary M"},{"$f":"[1]Sheet1!B264","v":"8000460"},{"$f":"[1]Sheet1!C264","v":"m"},{"$f":"[1]Sheet1!D264","v":"1960-09-01"},{"$f":"[1]Sheet1!L264","v":"2008-11-10"},"2099-12-31",null,7,7,0.25,0.25,{"$f":"[1]Sheet1!K264","v":98211},{"$f":"[1]Sheet1!I264","v":1},1,{"$f":"[1]Sheet1!M264","v":"2016-10-12"},{"$f":"[1]Sheet1!R264","v":"2023-10-12"},{"$f":"IF(AJ378>0, IF(AJ378<H378, [1]Sheet1!Q264/L378/M378, 0),0)","v":0},{"$f":"IF(AJ378>0, IF(AJ378>=H378, [1]Sheet1!O264/L378/M378 -S378, 0),0)","v":0},{"$f":" IF(AJ378>H378, [1]Sheet1!Q264/L378/M378, 0)","v":0},null,null,null,null,null,null,33847,1,1,0,0,0,9.4899999999999998E-2]
[{"$f":"[1]Sheet1!A265","v":"Reid, Gregory C"},{"$f":"[1]Sheet1!B265","v":"8000464"},{"$f":"[1]Sheet1!C265","v":"m"},{"$f":"[1]Sheet1!D265","v":"1957-12-20"},{"$f":"[1]Sheet1!L265","v":"2006-10-09"},"2099-12-31",null,7,7,0.25,0.25,{"$f":"[1]Sheet1!K265","v":95709},{"$f":"[1]Sheet1!I265","v":1},1,{"$f":"[1]Sheet1!M265","v":"2016-12-13"},{"$f":"[1]Sheet1!R265","v":"2023-12-13"},{"$f":"IF(AJ379>0, IF(AJ379<H379, [1]Sheet1!Q265/L379/M379, 0),0)","v":0},{"$f":"IF(AJ379>0, IF(AJ379>=H379, [1]Sheet1!O265/L379/M379 -S379, 0),0)","v":0},{"$f":" IF(AJ379>H379, [1]Sheet1!Q265/L379/M379, 0)","v":0},null,null,null,null,null,null,33847,1,1,0,0,0,9.4899999999999998E-2]
[{"$f":"[1]Sheet1!A266","v":"Reid, Stephanie"},{"$f":"[1]Sheet1!B266","v":"8000465"},{"$f":"[1]Sheet1!C266","v":"f"},{"$f":"[1]Sheet1!D266","v":"1969-12-24"},{"$f":"[1]Sheet1!L266","v":"2007-01-01"},"2099-12-31",null,7,7,0.25,0.25,{"$f":"[1]Sheet1!K266","v":64256},{"$f":"[1]Sheet1!I266","v":0.8},0.8,{"$f":"[1]Sheet1!M266","v":"2014-09-29"},{"$f":"[1]Sheet1!R266","v":"2021-09-29"},{"$f":"IF(AJ380>0, IF(AJ380<H380, [1]Sheet1!Q266/L380/M380, 0),0)","v":0},{"$f":"IF(AJ380>0, IF(AJ380>=H380, [1]Sheet1!O266/L380/M380 -S380, 0),0)","v":0},{"$f":" IF(AJ380>H380, [1]Sheet1!Q266/L380/M380, 0)","v":0},null,null,null,null,null,null,33847,1,1,0,0,0,9.4899999999999998E-2]
[{"$f":"[1]Sheet1!A267","v":"Rickards, Merinda L"},{"$f":"[1]Sheet1!B267","v":"8000468"},{"$f":"[1]Sheet1!C267","v":"f"},{"$f":"[1]Sheet1!D267","v":"1973-12-20"},{"$f":"[1]Sheet1!L267","v":"2011-08-08"},"2099-12-31",null,7,7,0.25,0.25,{"$f":"[1]Sheet1!K267","v":95709},{"$f":"[1]Sheet1!I267","v":1},1,{"$f":"[1]Sheet1!M267","v":"2011-09-11"},{"$f":"[1]Sheet1!R267","v":"2018-09-11"},{"$f":"IF(AJ381>0, IF(AJ381<H381, [1]Sheet1!Q267/L381/M381, 0),0)","v":0},{"$f":"IF(AJ381>0, IF(AJ381>=H381, [1]Sheet1!O267/L381/M381 -S381, 0),0)","v":0},{"$f":" IF(AJ381>H381, [1]Sheet1!Q267/L381/M381, 0)","v":0},null,null,null,null,null,null,33847,1,1,0,0,0,9.4899999999999998E-2]
[{"$f":"[1]Sheet1!A268","v":"Riley, Peta G"},{"$f":"[1]Sheet1!B268","v":"8000470"},{"$f":"[1]Sheet1!C268","v":"f"},{"$f":"[1]Sheet1!D268","v":"1976-01-02"},{"$f":"[1]Sheet1!L268","v":"2006-07-31"},"2099-12-31",null,7,7,0.25,0.25,{"$f":"[1]Sheet1!K268","v":88830},{"$f":"[1]Sheet1!I268","v":0.62},0.62,{"$f":"[1]Sheet1!M268","v":"2017-02-12"},{"$f":"[1]Sheet1!R268","v":"2024-02-12"},{"$f":"IF(AJ382>0, IF(AJ382<H382, [1]Sheet1!Q268/L382/M382, 0),0)","v":0},{"$f":"IF(AJ382>0, IF(AJ382>=H382, [1]Sheet1!O268/L382/M382 -S382, 0),0)","v":0},{"$f":" IF(AJ382>H382, [1]Sheet1!Q268/L382/M382, 0)","v":0},null,null,null,null,null,null,33847,1,1,0,0,0,9.4899999999999998E-2]
[{"$f":"[1]Sheet1!A269","v":"Ritchie, Emma J"},{"$f":"[1]Sheet1!B269","v":"8000471"},{"$f":"[1]Sheet1!C269","v":"f"},{"$f":"[1]Sheet1!D269","v":"1980-07-25"},{"$f":"[1]Sheet1!L269","v":"2011-01-01"},"2099-12-31",null,7,7,0.25,0.25,{"$f":"[1]Sheet1!K269","v":124033},{"$f":"[1]Sheet1!I269","v":1},1,{"$f":"[1]Sheet1!M269","v":"2011-05-10"},{"$f":"[1]Sheet1!R269","v":"2018-05-10"},{"$f":"IF(AJ383>0, IF(AJ383<H383, [1]Sheet1!Q269/L383/M383, 0),0)","v":0},{"$f":"IF(AJ383>0, IF(AJ383>=H383, [1]Sheet1!O269/L383/M383 -S383, 0),0)","v":0},{"$f":" IF(AJ383>H383, [1]Sheet1!Q269/L383/M383, 0)","v":0},null,null,null,null,null,null,33847,1,1,0,0,0,9.4899999999999998E-2]
[{"$f":"[1]Sheet1!A270","v":"Rob, Deborah"},{"$f":"[1]Sheet1!B270","v":"8000473"},{"$f":"[1]Sheet1!C270","v":"f"},{"$f":"[1]Sheet1!D270","v":"1963-04-26"},{"$f":"[1]Sheet1!L270","v":"2012-04-21"},"2099-12-31",null,7,7,0.25,0.25,{"$f":"[1]Sheet1!K270","v":53136},{"$f":"[1]Sheet1!I270","v":1},1,{"$f":"[1]Sheet1!M270","v":"2012-06-16"},{"$f":"[1]Sheet1!R270","v":"2019-06-16"},{"$f":"IF(AJ384>0, IF(AJ384<H384, [1]Sheet1!Q270/L384/M384, 0),0)","v":0},{"$f":"IF(AJ384>0, IF(AJ384>=H384, [1]Sheet1!O270/L384/M384 -S384, 0),0)","v":0},{"$f":" IF(AJ384>H384, [1]Sheet1!Q270/L384/M384, 0)","v":0},null,null,null,null,null,null,33847,1,1,0,0,0,9.4899999999999998E-2]
[{"$f":"[1]Sheet1!A271","v":"Rogers, Elizabeth"},{"$f":"[1]Sheet1!B271","v":"8000476"},{"$f":"[1]Sheet1!C271","v":"f"},{"$f":"[1]Sheet1!D271","v":"1975-09-04"},{"$f":"[1]Sheet1!L271","v":"2014-08-11"},"2099-12-31",null,7,7,0.25,0.25,{"$f":"[1]Sheet1!K271","v":78517},{"$f":"[1]Sheet1!I271","v":0.5},0.5,{"$f":"[1]Sheet1!M271","v":"2015-05-04"},{"$f":"[1]Sheet1!R271","v":"2022-05-04"},{"$f":"IF(AJ385>0, IF(AJ385<H385, [1]Sheet1!Q271/L385/M385, 0),0)","v":0},{"$f":"IF(AJ385>0, IF(AJ385>=H385, [1]Sheet1!O271/L385/M385 -S385, 0),0)","v":0},{"$f":" IF(AJ385>H385, [1]Sheet1!Q271/L385/M385, 0)","v":0},null,null,null,null,null,null,33847,1,1,0,0,0,9.4899999999999998E-2]
[{"$f":"[1]Sheet1!A272","v":"Ross, Sharon M"},{"$f":"[1]Sheet1!B272","v":"8000479"},{"$f":"[1]Sheet1!C272","v":"f"},{"$f":"[1]Sheet1!D272","v":"1959-12-29"},{"$f":"[1]Sheet1!L272","v":"1997-05-26"},"2099-12-31",null,7,7,0.25,0.25,{"$f":"[1]Sheet1!K272","v":109838},{"$f":"[1]Sheet1!I272","v":1},1,{"$f":"[1]Sheet1!M272","v":"2011-10-12"},{"$f":"[1]Sheet1!R272","v":"2018-10-12"},{"$f":"IF(AJ386>0, IF(AJ386<H386, [1]Sheet1!Q272/L386/M386, 0),0)","v":0},{"$f":"IF(AJ386>0, IF(AJ386>=H386, [1]Sheet1!O272/L386/M386 -S386, 0),0)","v":0},{"$f":" IF(AJ386>H386, [1]Sheet1!Q272/L386/M386, 0)","v":0},null,null,null,null,null,null,33847,1,1,0,0,0,9.4899999999999998E-2]
[{"$f":"[1]Sheet1!A273","v":"Rosser, Jacinta M"},{"$f":"[1]Sheet1!B273","v":"8000480"},{"$f":"[1]Sheet1!C273","v":"f"},{"$f":"[1]Sheet1!D273","v":"1976-06-29"},{"$f":"[1]Sheet1!L273","v":"2000-02-07"},"2099-12-31",null,7,7,0.25,0.25,{"$f":"[1]Sheet1!K273","v":111106},{"$f":"[1]Sheet1!I273","v":1},1,{"$f":"[1]Sheet1!M273","v":"2010-06-03"},{"$f":"[1]Sheet1!R273","v":"2017-06-03"},{"$f":"IF(AJ387>0, IF(AJ387<H387, [1]Sheet1!Q273/L387/M387, 0),0)","v":0},{"$f":"IF(AJ387>0, IF(AJ387>=H387, [1]Sheet1!O273/L387/M387 -S387, 0),0)","v":0},{"$f":" IF(AJ387>H387, [1]Sheet1!Q273/L387/M387, 0)","v":0},null,null,null,null,null,null,33847,1,1,0,0,0,9.4899999999999998E-2]
[{"$f":"[1]Sheet1!A274","v":"Sakthivelpathi, Karpagam"},{"$f":"[1]Sheet1!B274","v":"8000486"},{"$f":"[1]Sheet1!C274","v":"f"},{"$f":"[1]Sheet1!D274","v":"1966-10-22"},{"$f":"[1]Sheet1!L274","v":"1996-04-29"},"2099-12-31",null,7,7,0.25,0.25,{"$f":"[1]Sheet1!K274","v":111106},{"$f":"[1]Sheet1!I274","v":1},1,{"$f":"[1]Sheet1!M274","v":"2011-09-11"},{"$f":"[1]Sheet1!R274","v":"2018-09-11"},{"$f":"IF(AJ388>0, IF(AJ388<H388, [1]Sheet1!Q274/L388/M388, 0),0)","v":0},{"$f":"IF(AJ388>0, IF(AJ388>=H388, [1]Sheet1!O274/L388/M388 -S388, 0),0)","v":0},{"$f":" IF(AJ388>H388, [1]Sheet1!Q274/L388/M388, 0)","v":0},null,null,null,null,null,null,33847,1,1,0,0,0,9.4899999999999998E-2]
[{"$f":"[1]Sheet1!A275","v":"Santamaria Sorice, Katye"},{"$f":"[1]Sheet1!B275","v":"8000490"},{"$f":"[1]Sheet1!C275","v":"f"},{"$f":"[1]Sheet1!D275","v":"1961-12-11"},{"$f":"[1]Sheet1!L275","v":"2001-07-23"},"2099-12-31",null,7,7,0.25,0.25,{"$f":"[1]Sheet1!K275","v":101943},{"$f":"[1]Sheet1!I275","v":0.1},0.1,{"$f":"[1]Sheet1!M275","v":"2012-07-02"},{"$f":"[1]Sheet1!R275","v":"2019-07-02"},{"$f":"IF(AJ389>0, IF(AJ389<H389, [1]Sheet1!Q275/L389/M389, 0),0)","v":0},{"$f":"IF(AJ389>0, IF(AJ389>=H389, [1]Sheet1!O275/L389/M389 -S389, 0),0)","v":0},{"$f":" IF(AJ389>H389, [1]Sheet1!Q275/L389/M389, 0)","v":0},null,null,null,null,null,null,33847,1,1,0,0,0,9.4899999999999998E-2]
[{"$f":"[1]Sheet1!A276","v":"Sarangapani, Sakthivelpathi"},{"$f":"[1]Sheet1!B276","v":"8000491"},{"$f":"[1]Sheet1!C276","v":"m"},{"$f":"[1]Sheet1!D276","v":"1959-05-05"},{"$f":"[1]Sheet1!L276","v":"1996-02-01"},"2099-12-31",null,7,7,0.25,0.25,{"$f":"[1]Sheet1!K276","v":111106},{"$f":"[1]Sheet1!I276","v":1},1,{"$f":"[1]Sheet1!M276","v":"2010-08-04"},{"$f":"[1]Sheet1!R276","v":"2017-08-04"},{"$f":"IF(AJ390>0, IF(AJ390<H390, [1]Sheet1!Q276/L390/M390, 0),0)","v":0},{"$f":"IF(AJ390>0, IF(AJ390>=H390, [1]Sheet1!O276/L390/M390 -S390, 0),0)","v":0},{"$f":" IF(AJ390>H390, [1]Sheet1!Q276/L390/M390, 0)","v":0},null,null,null,null,null,null,33847,1,1,0,0,0,9.4899999999999998E-2]
[{"$f":"[1]Sheet1!A277","v":"Scally, Wayne M"},{"$f":"[1]Sheet1!B277","v":"8000493"},{"$f":"[1]Sheet1!C277","v":"m"},{"$f":"[1]Sheet1!D277","v":"1960-02-04"},{"$f":"[1]Sheet1!L277","v":"2004-03-08"},"2099-12-31",null,7,7,0.25,0.25,{"$f":"[1]Sheet1!K277","v":111106},{"$f":"[1]Sheet1!I277","v":1},1,{"$f":"[1]Sheet1!M277","v":"2011-10-11"},{"$f":"[1]Sheet1!R277","v":"2018-10-11"},{"$f":"IF(AJ391>0, IF(AJ391<H391, [1]Sheet1!Q277/L391/M391, 0),0)","v":0},{"$f":"IF(AJ391>0, IF(AJ391>=H391, [1]Sheet1!O277/L391/M391 -S391, 0),0)","v":0},{"$f":" IF(AJ391>H391, [1]Sheet1!Q277/L391/M391, 0)","v":0},null,null,null,null,null,null,33847,1,1,0,0,0,9.4899999999999998E-2]
[{"$f":"[1]Sheet1!A278","v":"Schkabara, Franca"},{"$f":"[1]Sheet1!B278","v":"8000494"},{"$f":"[1]Sheet1!C278","v":"f"},{"$f":"[1]Sheet1!D278","v":"1958-01-11"},{"$f":"[1]Sheet1!L278","v":"1998-09-07"},"2099-12-31",null,7,7,0.25,0.25,{"$f":"[1]Sheet1!K278","v":57376},{"$f":"[1]Sheet1!I278","v":0.6},0.6,{"$f":"[1]Sheet1!M278","v":"2017-02-12"},{"$f":"[1]Sheet1!R278","v":"2024-02-12"},{"$f":"IF(AJ392>0, IF(AJ392<H392, [1]Sheet1!Q278/L392/M392, 0),0)","v":0},{"$f":"IF(AJ392>0, IF(AJ392>=H392, [1]Sheet1!O278/L392/M392 -S392, 0),0)","v":0},{"$f":" IF(AJ392>H392, [1]Sheet1!Q278/L392/M392, 0)","v":0},null,null,null,null,null,null,33847,1,1,0,0,0,9.4899999999999998E-2]
[{"$f":"[1]Sheet1!A279","v":"Sheehy, Paul B"},{"$f":"[1]Sheet1!B279","v":"8000497"},{"$f":"[1]Sheet1!C279","v":"m"},{"$f":"[1]Sheet1!D279","v":"1967-11-02"},{"$f":"[1]Sheet1!L279","v":"2010-09-20"},"2099-12-31",null,7,7,0.25,0.25,{"$f":"[1]Sheet1!K279","v":98211},{"$f":"[1]Sheet1!I279","v":1},1,{"$f":"[1]Sheet1!M279","v":"2010-10-05"},{"$f":"[1]Sheet1!R279","v":"2017-10-05"},{"$f":"IF(AJ393>0, IF(AJ393<H393, [1]Sheet1!Q279/L393/M393, 0),0)","v":0},{"$f":"IF(AJ393>0, IF(AJ393>=H393, [1]Sheet1!O279/L393/M393 -S393, 0),0)","v":0},{"$f":" IF(AJ393>H393, [1]Sheet1!Q279/L393/M393, 0)","v":0},null,null,null,null,null,null,33847,1,1,0,0,0,9.4899999999999998E-2]
[{"$f":"[1]Sheet1!A280","v":"Sherlock, Geoffrey H"},{"$f":"[1]Sheet1!B280","v":"8000498"},{"$f":"[1]Sheet1!C280","v":"m"},{"$f":"[1]Sheet1!D280","v":"1966-09-10"},{"$f":"[1]Sheet1!L280","v":"2004-08-25"},"2099-12-31",null,7,7,0.25,0.25,{"$f":"[1]Sheet1!K280","v":84599},{"$f":"[1]Sheet1!I280","v":1},1,{"$f":"[1]Sheet1!M280","v":"2012-04-15"},{"$f":"[1]Sheet1!R280","v":"2019-04-15"},{"$f":"IF(AJ394>0, IF(AJ394<H394, [1]Sheet1!Q280/L394/M394, 0),0)","v":0},{"$f":"IF(AJ394>0, IF(AJ394>=H394, [1]Sheet1!O280/L394/M394 -S394, 0),0)","v":0},{"$f":" IF(AJ394>H394, [1]Sheet1!Q280/L394/M394, 0)","v":0},null,null,null,null,null,null,33847,1,1,0,0,0,9.4899999999999998E-2]
[{"$f":"[1]Sheet1!A281","v":"Shiosaki, Ryan J"},{"$f":"[1]Sheet1!B281","v":"8000500"},{"$f":"[1]Sheet1!C281","v":"m"},{"$f":"[1]Sheet1!D281","v":"1982-06-26"},{"$f":"[1]Sheet1!L281","v":"2015-09-21"},"2099-12-31",null,7,7,0.25,0.25,{"$f":"[1]Sheet1!K281","v":60781},{"$f":"[1]Sheet1!I281","v":1},1,{"$f":"[1]Sheet1!M281","v":"2015-11-05"},{"$f":"[1]Sheet1!R281","v":"2022-11-05"},{"$f":"IF(AJ395>0, IF(AJ395<H395, [1]Sheet1!Q281/L395/M395, 0),0)","v":0},{"$f":"IF(AJ395>0, IF(AJ395>=H395, [1]Sheet1!O281/L395/M395 -S395, 0),0)","v":0},{"$f":" IF(AJ395>H395, [1]Sheet1!Q281/L395/M395, 0)","v":0},null,null,null,null,null,null,33847,1,1,0,0,0,9.4899999999999998E-2]
[{"$f":"[1]Sheet1!A282","v":"Silvester, Amanda J"},{"$f":"[1]Sheet1!B282","v":"8000501"},{"$f":"[1]Sheet1!C282","v":"f"},{"$f":"[1]Sheet1!D282","v":"1973-12-13"},{"$f":"[1]Sheet1!L282","v":"2012-05-14"},"2099-12-31",null,7,7,0.25,0.25,{"$f":"[1]Sheet1!K282","v":111106},{"$f":"[1]Sheet1!I282","v":1},1,{"$f":"[1]Sheet1!M282","v":"2012-06-16"},{"$f":"[1]Sheet1!R282","v":"2019-06-16"},{"$f":"IF(AJ396>0, IF(AJ396<H396, [1]Sheet1!Q282/L396/M396, 0),0)","v":0},{"$f":"IF(AJ396>0, IF(AJ396>=H396, [1]Sheet1!O282/L396/M396 -S396, 0),0)","v":0},{"$f":" IF(AJ396>H396, [1]Sheet1!Q282/L396/M396, 0)","v":0},null,null,null,null,null,null,33847,1,1,0,0,0,9.4899999999999998E-2]
[{"$f":"[1]Sheet1!A283","v":"Silvester, Matthew N"},{"$f":"[1]Sheet1!B283","v":"8000502"},{"$f":"[1]Sheet1!C283","v":"m"},{"$f":"[1]Sheet1!D283","v":"1973-03-07"},{"$f":"[1]Sheet1!L283","v":"2001-03-06"},"2099-12-31",null,7,7,0.25,0.25,{"$f":"[1]Sheet1!K283","v":124033},{"$f":"[1]Sheet1!I283","v":1},1,{"$f":"[1]Sheet1!M283","v":"2015-09-04"},{"$f":"[1]Sheet1!R283","v":"2022-09-04"},{"$f":"IF(AJ397>0, IF(AJ397<H397, [1]Sheet1!Q283/L397/M397, 0),0)","v":0},{"$f":"IF(AJ397>0, IF(AJ397>=H397, [1]Sheet1!O283/L397/M397 -S397, 0),0)","v":0},{"$f":" IF(AJ397>H397, [1]Sheet1!Q283/L397/M397, 0)","v":0},null,null,null,null,null,null,33847,1,1,0,0,0,9.4899999999999998E-2]
[{"$f":"[1]Sheet1!A284","v":"Simmons, Adele"},{"$f":"[1]Sheet1!B284","v":"8000503"},{"$f":"[1]Sheet1!C284","v":"f"},{"$f":"[1]Sheet1!D284","v":"1952-09-19"},{"$f":"[1]Sheet1!L284","v":"2013-07-01"},"2099-12-31",null,7,7,0.25,0.25,{"$f":"[1]Sheet1!K284","v":80797},{"$f":"[1]Sheet1!I284","v":0.6},0.6,{"$f":"[1]Sheet1!M284","v":"2014-03-27"},{"$f":"[1]Sheet1!R284","v":"2021-03-27"},{"$f":"IF(AJ398>0, IF(AJ398<H398, [1]Sheet1!Q284/L398/M398, 0),0)","v":0},{"$f":"IF(AJ398>0, IF(AJ398>=H398, [1]Sheet1!O284/L398/M398 -S398, 0),0)","v":0},{"$f":" IF(AJ398>H398, [1]Sheet1!Q284/L398/M398, 0)","v":0},null,null,null,null,null,null,33847,1,1,0,0,0,9.4899999999999998E-2]
[{"$f":"[1]Sheet1!A285","v":"Sims, Daniel R"},{"$f":"[1]Sheet1!B285","v":"8000504"},{"$f":"[1]Sheet1!C285","v":"m"},{"$f":"[1]Sheet1!D285","v":"1965-08-18"},{"$f":"[1]Sheet1!L285","v":"2008-01-23"},"2099-12-31",null,7,7,0.25,0.25,{"$f":"[1]Sheet1!K285","v":87815},{"$f":"[1]Sheet1!I285","v":1},1,{"$f":"[1]Sheet1!M285","v":"2015-06-03"},{"$f":"[1]Sheet1!R285","v":"2022-06-03"},{"$f":"IF(AJ399>0, IF(AJ399<H399, [1]Sheet1!Q285/L399/M399, 0),0)","v":0},{"$f":"IF(AJ399>0, IF(AJ399>=H399, [1]Sheet1!O285/L399/M399 -S399, 0),0)","v":0},{"$f":" IF(AJ399>H399, [1]Sheet1!Q285/L399/M399, 0)","v":0},null,null,null,null,null,null,33847,1,1,0,0,0,9.4899999999999998E-2]
[{"$f":"[1]Sheet1!A286","v":"Sinclair, Jessica"},{"$f":"[1]Sheet1!B286","v":"8000505"},{"$f":"[1]Sheet1!C286","v":"f"},{"$f":"[1]Sheet1!D286","v":"1988-09-16"},{"$f":"[1]Sheet1!L286","v":"2013-12-02"},"2099-12-31",null,7,7,0.25,0.25,{"$f":"[1]Sheet1!K286","v":64256},{"$f":"[1]Sheet1!I286","v":1},1,{"$f":"[1]Sheet1!M286","v":"2014-01-24"},{"$f":"[1]Sheet1!R286","v":"2021-01-24"},{"$f":"IF(AJ400>0, IF(AJ400<H400, [1]Sheet1!Q286/L400/M400, 0),0)","v":0},{"$f":"IF(AJ400>0, IF(AJ400>=H400, [1]Sheet1!O286/L400/M400 -S400, 0),0)","v":0},{"$f":" IF(AJ400>H400, [1]Sheet1!Q286/L400/M400, 0)","v":0},null,null,null,null,null,null,33847,1,1,0,0,0,9.4899999999999998E-2]
[{"$f":"[1]Sheet1!A287","v":"Smith, Helen L"},{"$f":"[1]Sheet1!B287","v":"8000509"},{"$f":"[1]Sheet1!C287","v":"f"},{"$f":"[1]Sheet1!D287","v":"1961-02-15"},{"$f":"[1]Sheet1!L287","v":"2005-01-11"},"2099-12-31",null,7,7,0.25,0.25,{"$f":"[1]Sheet1!K287","v":111106},{"$f":"[1]Sheet1!I287","v":1},1,{"$f":"[1]Sheet1!M287","v":"2012-07-17"},{"$f":"[1]Sheet1!R287","v":"2019-07-17"},{"$f":"IF(AJ401>0, IF(AJ401<H401, [1]Sheet1!Q287/L401/M401, 0),0)","v":0},{"$f":"IF(AJ401>0, IF(AJ401>=H401, [1]Sheet1!O287/L401/M401 -S401, 0),0)","v":0},{"$f":" IF(AJ401>H401, [1]Sheet1!Q287/L401/M401, 0)","v":0},null,null,null,null,null,null,33847,1,1,0,0,0,9.4899999999999998E-2]
[{"$f":"[1]Sheet1!A288","v":"Smith, Murray M"},{"$f":"[1]Sheet1!B288","v":"8000511"},{"$f":"[1]Sheet1!C288","v":"m"},{"$f":"[1]Sheet1!D288","v":"1971-04-27"},{"$f":"[1]Sheet1!L288","v":"2000-03-30"},"2099-12-31",null,7,7,0.25,0.25,{"$f":"[1]Sheet1!K288","v":80797},{"$f":"[1]Sheet1!I288","v":1},1,{"$f":"[1]Sheet1!M288","v":"2014-11-30"},{"$f":"[1]Sheet1!R288","v":"2021-11-30"},{"$f":"IF(AJ402>0, IF(AJ402<H402, [1]Sheet1!Q288/L402/M402, 0),0)","v":0},{"$f":"IF(AJ402>0, IF(AJ402>=H402, [1]Sheet1!O288/L402/M402 -S402, 0),0)","v":0},{"$f":" IF(AJ402>H402, [1]Sheet1!Q288/L402/M402, 0)","v":0},null,null,null,null,null,null,33847,1,1,0,0,0,9.4899999999999998E-2]
[{"$f":"[1]Sheet1!A289","v":"Snook, Owen L"},{"$f":"[1]Sheet1!B289","v":"8000513"},{"$f":"[1]Sheet1!C289","v":"m"},{"$f":"[1]Sheet1!D289","v":"1949-02-12"},{"$f":"[1]Sheet1!L289","v":"2012-08-17"},"2099-12-31",null,7,7,0.25,0.25,{"$f":"[1]Sheet1!K289","v":75295},{"$f":"[1]Sheet1!I289","v":0.5},0.5,{"$f":"[1]Sheet1!M289","v":"2015-03-03"},{"$f":"[1]Sheet1!R289","v":"2022-03-03"},{"$f":"IF(AJ403>0, IF(AJ403<H403, [1]Sheet1!Q289/L403/M403, 0),0)","v":0},{"$f":"IF(AJ403>0, IF(AJ403>=H403, [1]Sheet1!O289/L403/M403 -S403, 0),0)","v":0},{"$f":" IF(AJ403>H403, [1]Sheet1!Q289/L403/M403, 0)","v":0},null,null,null,null,null,null,33847,1,1,0,0,0,9.4899999999999998E-2]
[{"$f":"[1]Sheet1!A290","v":"Snowball, Tracey A"},{"$f":"[1]Sheet1!B290","v":"8000514"},{"$f":"[1]Sheet1!C290","v":"f"},{"$f":"[1]Sheet1!D290","v":"1958-05-01"},{"$f":"[1]Sheet1!L290","v":"2008-05-28"},"2099-12-31",null,7,7,0.25,0.25,{"$f":"[1]Sheet1!K290","v":59172},{"$f":"[1]Sheet1!I290","v":1},1,{"$f":"[1]Sheet1!M290","v":"2015-10-05"},{"$f":"[1]Sheet1!R290","v":"2022-10-05"},{"$f":"IF(AJ404>0, IF(AJ404<H404, [1]Sheet1!Q290/L404/M404, 0),0)","v":0},{"$f":"IF(AJ404>0, IF(AJ404>=H404, [1]Sheet1!O290/L404/M404 -S404, 0),0)","v":0},{"$f":" IF(AJ404>H404, [1]Sheet1!Q290/L404/M404, 0)","v":0},null,null,null,null,null,null,33847,1,1,0,0,0,9.4899999999999998E-2]
[{"$f":"[1]Sheet1!A291","v":"Stanger, Volker D"},{"$f":"[1]Sheet1!B291","v":"8000516"},{"$f":"[1]Sheet1!C291","v":"m"},{"$f":"[1]Sheet1!D291","v":"1960-06-18"},{"$f":"[1]Sheet1!L291","v":"2014-04-28"},"2099-12-31",null,7,7,0.25,0.25,{"$f":"[1]Sheet1!K291","v":81502},{"$f":"[1]Sheet1!I291","v":1},1,{"$f":"[1]Sheet1!M291","v":"2014-08-29"},{"$f":"[1]Sheet1!R291","v":"2021-08-29"},{"$f":"IF(AJ405>0, IF(AJ405<H405, [1]Sheet1!Q291/L405/M405, 0),0)","v":0},{"$f":"IF(AJ405>0, IF(AJ405>=H405, [1]Sheet1!O291/L405/M405 -S405, 0),0)","v":0},{"$f":" IF(AJ405>H405, [1]Sheet1!Q291/L405/M405, 0)","v":0},null,null,null,null,null,null,33847,1,1,0,0,0,9.4899999999999998E-2]
[{"$f":"[1]Sheet1!A292","v":"Stanton, Micheal"},{"$f":"[1]Sheet1!B292","v":"8000517"},{"$f":"[1]Sheet1!C292","v":"m"},{"$f":"[1]Sheet1!D292","v":"1977-11-23"},{"$f":"[1]Sheet1!L292","v":"2016-04-11"},"2099-12-31",null,7,7,0.25,0.25,{"$f":"[1]Sheet1!K292","v":109590},{"$f":"[1]Sheet1!I292","v":1},1,{"$f":"[1]Sheet1!M292","v":"2011-02-06"},{"$f":"[1]Sheet1!R292","v":"2018-02-06"},{"$f":"IF(AJ406>0, IF(AJ406<H406, [1]Sheet1!Q292/L406/M406, 0),0)","v":0},{"$f":"IF(AJ406>0, IF(AJ406>=H406, [1]Sheet1!O292/L406/M406 -S406, 0),0)","v":0},{"$f":" IF(AJ406>H406, [1]Sheet1!Q292/L406/M406, 0)","v":0},null,null,null,null,null,null,33847,1,1,0,0,0,9.4899999999999998E-2]
[{"$f":"[1]Sheet1!A293","v":"Starcevich, Carmel T"},{"$f":"[1]Sheet1!B293","v":"8000518"},{"$f":"[1]Sheet1!C293","v":"f"},{"$f":"[1]Sheet1!D293","v":"1963-06-07"},{"$f":"[1]Sheet1!L293","v":"2015-03-30"},"2099-12-31",null,7,7,0.25,0.25,{"$f":"[1]Sheet1!K293","v":64256},{"$f":"[1]Sheet1!I293","v":1},1,{"$f":"[1]Sheet1!M293","v":"2015-05-04"},{"$f":"[1]Sheet1!R293","v":"2022-05-04"},{"$f":"IF(AJ407>0, IF(AJ407<H407, [1]Sheet1!Q293/L407/M407, 0),0)","v":0},{"$f":"IF(AJ407>0, IF(AJ407>=H407, [1]Sheet1!O293/L407/M407 -S407, 0),0)","v":0},{"$f":" IF(AJ407>H407, [1]Sheet1!Q293/L407/M407, 0)","v":0},null,null,null,null,null,null,33847,1,1,0,0,0,9.4899999999999998E-2]
[{"$f":"[1]Sheet1!A294","v":"Stoney, Barbara R"},{"$f":"[1]Sheet1!B294","v":"8000521"},{"$f":"[1]Sheet1!C294","v":"f"},{"$f":"[1]Sheet1!D294","v":"1952-01-31"},{"$f":"[1]Sheet1!L294","v":"2009-04-27"},"2099-12-31",null,7,7,0.25,0.25,{"$f":"[1]Sheet1!K294","v":64256},{"$f":"[1]Sheet1!I294","v":0.6},0.6,{"$f":"[1]Sheet1!M294","v":"2016-06-10"},{"$f":"[1]Sheet1!R294","v":"2023-06-10"},{"$f":"IF(AJ408>0, IF(AJ408<H408, [1]Sheet1!Q294/L408/M408, 0),0)","v":0},{"$f":"IF(AJ408>0, IF(AJ408>=H408, [1]Sheet1!O294/L408/M408 -S408, 0),0)","v":0},{"$f":" IF(AJ408>H408, [1]Sheet1!Q294/L408/M408, 0)","v":0},null,null,null,null,null,null,33847,1,1,0,0,0,9.4899999999999998E-2]
[{"$f":"[1]Sheet1!A295","v":"Storer, Christine"},{"$f":"[1]Sheet1!B295","v":"8000522"},{"$f":"[1]Sheet1!C295","v":"f"},{"$f":"[1]Sheet1!D295","v":"1965-05-15"},{"$f":"[1]Sheet1!L295","v":"2013-07-01"},"2099-12-31",null,7,7,0.25,0.25,{"$f":"[1]Sheet1!K295","v":119701},{"$f":"[1]Sheet1!I295","v":1},1,{"$f":"[1]Sheet1!M295","v":"2016-01-06"},{"$f":"[1]Sheet1!R295","v":"2023-01-06"},{"$f":"IF(AJ409>0, IF(AJ409<H409, [1]Sheet1!Q295/L409/M409, 0),0)","v":0},{"$f":"IF(AJ409>0, IF(AJ409>=H409, [1]Sheet1!O295/L409/M409 -S409, 0),0)","v":0},{"$f":" IF(AJ409>H409, [1]Sheet1!Q295/L409/M409, 0)","v":0},null,null,null,null,null,null,33847,1,1,0,0,0,9.4899999999999998E-2]
[{"$f":"[1]Sheet1!A296","v":"Strutton, Skye L"},{"$f":"[1]Sheet1!B296","v":"8000526"},{"$f":"[1]Sheet1!C296","v":"f"},{"$f":"[1]Sheet1!D296","v":"1989-02-28"},{"$f":"[1]Sheet1!L296","v":"2016-01-11"},"2099-12-31",null,7,7,0.25,0.25,{"$f":"[1]Sheet1!K296","v":72204},{"$f":"[1]Sheet1!I296","v":0.6},0.6,{"$f":"[1]Sheet1!M296","v":"2016-03-09"},{"$f":"[1]Sheet1!R296","v":"2023-03-09"},{"$f":"IF(AJ410>0, IF(AJ410<H410, [1]Sheet1!Q296/L410/M410, 0),0)","v":0},{"$f":"IF(AJ410>0, IF(AJ410>=H410, [1]Sheet1!O296/L410/M410 -S410, 0),0)","v":0},{"$f":" IF(AJ410>H410, [1]Sheet1!Q296/L410/M410, 0)","v":0},null,null,null,null,null,null,33847,1,1,0,0,0,9.4899999999999998E-2]
[{"$f":"[1]Sheet1!A297","v":"Swetman, William G"},{"$f":"[1]Sheet1!B297","v":"8000529"},{"$f":"[1]Sheet1!C297","v":"m"},{"$f":"[1]Sheet1!D297","v":"1955-05-08"},{"$f":"[1]Sheet1!L297","v":"2015-08-19"},"2099-12-31",null,7,7,0.25,0.25,{"$f":"[1]Sheet1!K297","v":215000},{"$f":"[1]Sheet1!I297","v":1},1,{"$f":"[1]Sheet1!M297","v":"2011-07-11"},{"$f":"[1]Sheet1!R297","v":"2018-07-11"},{"$f":"IF(AJ411>0, IF(AJ411<H411, [1]Sheet1!Q297/L411/M411, 0),0)","v":0},{"$f":"IF(AJ411>0, IF(AJ411>=H411, [1]Sheet1!O297/L411/M411 -S411, 0),0)","v":0},{"$f":" IF(AJ411>H411, [1]Sheet1!Q297/L411/M411, 0)","v":0},null,null,null,null,null,null,33847,1,1,0,0,0,9.4899999999999998E-2]
[{"$f":"[1]Sheet1!A298","v":"Taylor, Sean"},{"$f":"[1]Sheet1!B298","v":"8000533"},{"$f":"[1]Sheet1!C298","v":"m"},{"$f":"[1]Sheet1!D298","v":"1974-05-05"},{"$f":"[1]Sheet1!L298","v":"2014-10-06"},"2099-12-31",null,7,7,0.25,0.25,{"$f":"[1]Sheet1!K298","v":87815},{"$f":"[1]Sheet1!I298","v":1},1,{"$f":"[1]Sheet1!M298","v":"2014-11-30"},{"$f":"[1]Sheet1!R298","v":"2021-11-30"},{"$f":"IF(AJ412>0, IF(AJ412<H412, [1]Sheet1!Q298/L412/M412, 0),0)","v":0},{"$f":"IF(AJ412>0, IF(AJ412>=H412, [1]Sheet1!O298/L412/M412 -S412, 0),0)","v":0},{"$f":" IF(AJ412>H412, [1]Sheet1!Q298/L412/M412, 0)","v":0},null,null,null,null,null,null,33847,1,1,0,0,0,9.4899999999999998E-2]
[{"$f":"[1]Sheet1!A299","v":"Tetlow, Kim"},{"$f":"[1]Sheet1!B299","v":"8000535"},{"$f":"[1]Sheet1!C299","v":"f"},{"$f":"[1]Sheet1!D299","v":"1984-07-30"},{"$f":"[1]Sheet1!L299","v":"2010-08-07"},"2099-12-31",null,7,7,0.25,0.25,{"$f":"[1]Sheet1!K299","v":57376},{"$f":"[1]Sheet1!I299","v":0.5},0.5,{"$f":"[1]Sheet1!M299","v":"2012-07-17"},{"$f":"[1]Sheet1!R299","v":"2019-07-17"},{"$f":"IF(AJ413>0, IF(AJ413<H413, [1]Sheet1!Q299/L413/M413, 0),0)","v":0},{"$f":"IF(AJ413>0, IF(AJ413>=H413, [1]Sheet1!O299/L413/M413 -S413, 0),0)","v":0},{"$f":" IF(AJ413>H413, [1]Sheet1!Q299/L413/M413, 0)","v":0},null,null,null,null,null,null,33847,1,1,0,0,0,9.4899999999999998E-2]
[{"$f":"[1]Sheet1!A300","v":"Thomas, Geoffery C"},{"$f":"[1]Sheet1!B300","v":"8000537"},{"$f":"[1]Sheet1!C300","v":"m"},{"$f":"[1]Sheet1!D300","v":"1958-11-23"},{"$f":"[1]Sheet1!L300","v":"2010-09-27"},"2099-12-31",null,7,7,0.25,0.25,{"$f":"[1]Sheet1!K300","v":98211},{"$f":"[1]Sheet1!I300","v":1},1,{"$f":"[1]Sheet1!M300","v":"2014-06-28"},{"$f":"[1]Sheet1!R300","v":"2021-06-28"},{"$f":"IF(AJ414>0, IF(AJ414<H414, [1]Sheet1!Q300/L414/M414, 0),0)","v":0},{"$f":"IF(AJ414>0, IF(AJ414>=H414, [1]Sheet1!O300/L414/M414 -S414, 0),0)","v":0},{"$f":" IF(AJ414>H414, [1]Sheet1!Q300/L414/M414, 0)","v":0},null,null,null,null,null,null,33847,1,1,0,0,0,9.4899999999999998E-2]
[{"$f":"[1]Sheet1!A301","v":"Thornton, Philip G"},{"$f":"[1]Sheet1!B301","v":"8000539"},{"$f":"[1]Sheet1!C301","v":"m"},{"$f":"[1]Sheet1!D301","v":"1950-03-04"},{"$f":"[1]Sheet1!L301","v":"2014-04-24"},"2099-12-31",null,7,7,0.25,0.25,{"$f":"[1]Sheet1!K301","v":78517},{"$f":"[1]Sheet1!I301","v":0.81},0.81,{"$f":"[1]Sheet1!M301","v":"2014-05-28"},{"$f":"[1]Sheet1!R301","v":"2021-05-28"},{"$f":"IF(AJ415>0, IF(AJ415<H415, [1]Sheet1!Q301/L415/M415, 0),0)","v":0},{"$f":"IF(AJ415>0, IF(AJ415>=H415, [1]Sheet1!O301/L415/M415 -S415, 0),0)","v":0},{"$f":" IF(AJ415>H415, [1]Sheet1!Q301/L415/M415, 0)","v":0},null,null,null,null,null,null,33847,1,1,0,0,0,9.4899999999999998E-2]
[{"$f":"[1]Sheet1!A302","v":"Timu, Pia A"},{"$f":"[1]Sheet1!B302","v":"8000540"},{"$f":"[1]Sheet1!C302","v":"f"},{"$f":"[1]Sheet1!D302","v":"1984-06-11"},{"$f":"[1]Sheet1!L302","v":"2014-10-01"},"2099-12-31",null,7,7,0.25,0.25,{"$f":"[1]Sheet1!K302","v":87915},{"$f":"[1]Sheet1!I302","v":1},1,{"$f":"[1]Sheet1!M302","v":"2015-05-04"},{"$f":"[1]Sheet1!R302","v":"2022-05-04"},{"$f":"IF(AJ416>0, IF(AJ416<H416, [1]Sheet1!Q302/L416/M416, 0),0)","v":0},{"$f":"IF(AJ416>0, IF(AJ416>=H416, [1]Sheet1!O302/L416/M416 -S416, 0),0)","v":0},{"$f":" IF(AJ416>H416, [1]Sheet1!Q302/L416/M416, 0)","v":0},null,null,null,null,null,null,33847,1,1,0,0,0,9.4899999999999998E-2]
[{"$f":"[1]Sheet1!A303","v":"Treen, Shane"},{"$f":"[1]Sheet1!B303","v":"8000546"},{"$f":"[1]Sheet1!C303","v":"m"},{"$f":"[1]Sheet1!D303","v":"1976-07-14"},{"$f":"[1]Sheet1!L303","v":"2015-03-25"},"2099-12-31",null,7,7,0.25,0.25,{"$f":"[1]Sheet1!K303","v":94614},{"$f":"[1]Sheet1!I303","v":1},1,{"$f":"[1]Sheet1!M303","v":"2015-05-04"},{"$f":"[1]Sheet1!R303","v":"2022-05-04"},{"$f":"IF(AJ417>0, IF(AJ417<H417, [1]Sheet1!Q303/L417/M417, 0),0)","v":0},{"$f":"IF(AJ417>0, IF(AJ417>=H417, [1]Sheet1!O303/L417/M417 -S417, 0),0)","v":0},{"$f":" IF(AJ417>H417, [1]Sheet1!Q303/L417/M417, 0)","v":0},null,null,null,null,null,null,33847,1,1,0,0,0,9.4899999999999998E-2]
[{"$f":"[1]Sheet1!A304","v":"Van Den Nieuwenhof, Christopher"},{"$f":"[1]Sheet1!B304","v":"8000550"},{"$f":"[1]Sheet1!C304","v":"m"},{"$f":"[1]Sheet1!D304","v":"1972-08-16"},{"$f":"[1]Sheet1!L304","v":"2011-01-01"},"2099-12-31",null,7,7,0.25,0.25,{"$f":"[1]Sheet1!K304","v":98211},{"$f":"[1]Sheet1!I304","v":1},1,{"$f":"[1]Sheet1!M304","v":"2011-01-06"},{"$f":"[1]Sheet1!R304","v":"2018-01-06"},{"$f":"IF(AJ418>0, IF(AJ418<H418, [1]Sheet1!Q304/L418/M418, 0),0)","v":0},{"$f":"IF(AJ418>0, IF(AJ418>=H418, [1]Sheet1!O304/L418/M418 -S418, 0),0)","v":0},{"$f":" IF(AJ418>H418, [1]Sheet1!Q304/L418/M418, 0)","v":0},null,null,null,null,null,null,33847,1,1,0,0,0,9.4899999999999998E-2]
[{"$f":"[1]Sheet1!A305","v":"Van Der Merwe, Rene"},{"$f":"[1]Sheet1!B305","v":"8000551"},{"$f":"[1]Sheet1!C305","v":"f"},{"$f":"[1]Sheet1!D305","v":"1960-03-01"},{"$f":"[1]Sheet1!L305","v":"2013-10-28"},"2099-12-31",null,7,7,0.25,0.25,{"$f":"[1]Sheet1!K305","v":64256},{"$f":"[1]Sheet1!I305","v":1},1,{"$f":"[1]Sheet1!M305","v":"2014-01-24"},{"$f":"[1]Sheet1!R305","v":"2021-01-24"},{"$f":"IF(AJ419>0, IF(AJ419<H419, [1]Sheet1!Q305/L419/M419, 0),0)","v":0},{"$f":"IF(AJ419>0, IF(AJ419>=H419, [1]Sheet1!O305/L419/M419 -S419, 0),0)","v":0},{"$f":" IF(AJ419>H419, [1]Sheet1!Q305/L419/M419, 0)","v":0},null,null,null,null,null,null,33847,1,1,0,0,0,9.4899999999999998E-2]
[{"$f":"[1]Sheet1!A306","v":"Van Der Merwe, Shaun"},{"$f":"[1]Sheet1!B306","v":"8000552"},{"$f":"[1]Sheet1!C306","v":"m"},{"$f":"[1]Sheet1!D306","v":"1965-10-18"},{"$f":"[1]Sheet1!L306","v":"2012-11-26"},"2099-12-31",null,7,7,0.25,0.25,{"$f":"[1]Sheet1!K306","v":103122},{"$f":"[1]Sheet1!I306","v":1},1,{"$f":"[1]Sheet1!M306","v":"2011-01-06"},{"$f":"[1]Sheet1!R306","v":"2018-01-06"},{"$f":"IF(AJ420>0, IF(AJ420<H420, [1]Sheet1!Q306/L420/M420, 0),0)","v":0},{"$f":"IF(AJ420>0, IF(AJ420>=H420, [1]Sheet1!O306/L420/M420 -S420, 0),0)","v":0},{"$f":" IF(AJ420>H420, [1]Sheet1!Q306/L420/M420, 0)","v":0},null,null,null,null,null,null,33847,1,1,0,0,0,9.4899999999999998E-2]
[{"$f":"[1]Sheet1!A307","v":"Van Der Merwe, Zia"},{"$f":"[1]Sheet1!B307","v":"8000553"},{"$f":"[1]Sheet1!C307","v":"f"},{"$f":"[1]Sheet1!D307","v":"1992-04-30"},{"$f":"[1]Sheet1!L307","v":"2014-02-04"},"2099-12-31",null,7,7,0.25,0.25,{"$f":"[1]Sheet1!K307","v":50315},{"$f":"[1]Sheet1!I307","v":1},1,{"$f":"[1]Sheet1!M307","v":"2014-03-27"},{"$f":"[1]Sheet1!R307","v":"2021-03-27"},{"$f":"IF(AJ421>0, IF(AJ421<H421, [1]Sheet1!Q307/L421/M421, 0),0)","v":0},{"$f":"IF(AJ421>0, IF(AJ421>=H421, [1]Sheet1!O307/L421/M421 -S421, 0),0)","v":0},{"$f":" IF(AJ421>H421, [1]Sheet1!Q307/L421/M421, 0)","v":0},null,null,null,null,null,null,33847,1,1,0,0,0,9.4899999999999998E-2]
[{"$f":"[1]Sheet1!A308","v":"Van Duyn, Samantha J"},{"$f":"[1]Sheet1!B308","v":"8000555"},{"$f":"[1]Sheet1!C308","v":"f"},{"$f":"[1]Sheet1!D308","v":"1973-10-21"},{"$f":"[1]Sheet1!L308","v":"2010-07-15"},"2099-12-31",null,7,7,0.25,0.25,{"$f":"[1]Sheet1!K308","v":47116.93},{"$f":"[1]Sheet1!I308","v":1},1,{"$f":"[1]Sheet1!M308","v":"2012-07-20"},{"$f":"[1]Sheet1!R308","v":"2019-07-20"},{"$f":"IF(AJ422>0, IF(AJ422<H422, [1]Sheet1!Q308/L422/M422, 0),0)","v":0},{"$f":"IF(AJ422>0, IF(AJ422>=H422, [1]Sheet1!O308/L422/M422 -S422, 0),0)","v":0},{"$f":" IF(AJ422>H422, [1]Sheet1!Q308/L422/M422, 0)","v":0},null,null,null,null,null,null,33847,1,1,0,0,0,9.4899999999999998E-2]
[{"$f":"[1]Sheet1!A309","v":"Van Tiel, Rheann"},{"$f":"[1]Sheet1!B309","v":"8000556"},{"$f":"[1]Sheet1!C309","v":"f"},{"$f":"[1]Sheet1!D309","v":"1984-12-09"},{"$f":"[1]Sheet1!L309","v":"2007-09-10"},"2099-12-31",null,7,7,0.25,0.25,{"$f":"[1]Sheet1!K309","v":64256},{"$f":"[1]Sheet1!I309","v":0.6},0.6,{"$f":"[1]Sheet1!M309","v":"2015-10-05"},{"$f":"[1]Sheet1!R309","v":"2022-10-05"},{"$f":"IF(AJ423>0, IF(AJ423<H423, [1]Sheet1!Q309/L423/M423, 0),0)","v":0},{"$f":"IF(AJ423>0, IF(AJ423>=H423, [1]Sheet1!O309/L423/M423 -S423, 0),0)","v":0},{"$f":" IF(AJ423>H423, [1]Sheet1!Q309/L423/M423, 0)","v":0},null,null,null,null,null,null,33847,1,1,0,0,0,9.4899999999999998E-2]
[{"$f":"[1]Sheet1!A310","v":"Varley, David G"},{"$f":"[1]Sheet1!B310","v":"8000557"},{"$f":"[1]Sheet1!C310","v":"m"},{"$f":"[1]Sheet1!D310","v":"1963-08-11"},{"$f":"[1]Sheet1!L310","v":"2005-01-11"},"2099-12-31",null,7,7,0.25,0.25,{"$f":"[1]Sheet1!K310","v":98211},{"$f":"[1]Sheet1!I310","v":1},1,{"$f":"[1]Sheet1!M310","v":"2012-04-15"},{"$f":"[1]Sheet1!R310","v":"2019-04-15"},{"$f":"IF(AJ424>0, IF(AJ424<H424, [1]Sheet1!Q310/L424/M424, 0),0)","v":0},{"$f":"IF(AJ424>0, IF(AJ424>=H424, [1]Sheet1!O310/L424/M424 -S424, 0),0)","v":0},{"$f":" IF(AJ424>H424, [1]Sheet1!Q310/L424/M424, 0)","v":0},null,null,null,null,null,null,33847,1,1,0,0,0,9.4899999999999998E-2]
[{"$f":"[1]Sheet1!A311","v":"Vener, Cassidy"},{"$f":"[1]Sheet1!B311","v":"8000559"},{"$f":"[1]Sheet1!C311","v":"f"},{"$f":"[1]Sheet1!D311","v":"1995-03-01"},{"$f":"[1]Sheet1!L311","v":"2016-09-19"},"2099-12-31",null,7,7,0.25,0.25,{"$f":"[1]Sheet1!K311","v":46349},{"$f":"[1]Sheet1!I311","v":1},1,{"$f":"[1]Sheet1!M311","v":"2016-11-12"},{"$f":"[1]Sheet1!R311","v":"2023-11-12"},{"$f":"IF(AJ425>0, IF(AJ425<H425, [1]Sheet1!Q311/L425/M425, 0),0)","v":0},{"$f":"IF(AJ425>0, IF(AJ425>=H425, [1]Sheet1!O311/L425/M425 -S425, 0),0)","v":0},{"$f":" IF(AJ425>H425, [1]Sheet1!Q311/L425/M425, 0)","v":0},null,null,null,null,null,null,33847,1,1,0,0,0,9.4899999999999998E-2]
[{"$f":"[1]Sheet1!A312","v":"Venter, Jan G"},{"$f":"[1]Sheet1!B312","v":"8000560"},{"$f":"[1]Sheet1!C312","v":"m"},{"$f":"[1]Sheet1!D312","v":"1973-10-18"},{"$f":"[1]Sheet1!L312","v":"2016-01-19"},"2099-12-31",null,7,7,0.25,0.25,{"$f":"[1]Sheet1!K312","v":85047},{"$f":"[1]Sheet1!I312","v":1},1,{"$f":"[1]Sheet1!M312","v":"2016-03-09"},{"$f":"[1]Sheet1!R312","v":"2023-03-09"},{"$f":"IF(AJ426>0, IF(AJ426<H426, [1]Sheet1!Q312/L426/M426, 0),0)","v":0},{"$f":"IF(AJ426>0, IF(AJ426>=H426, [1]Sheet1!O312/L426/M426 -S426, 0),0)","v":0},{"$f":" IF(AJ426>H426, [1]Sheet1!Q312/L426/M426, 0)","v":0},null,null,null,null,null,null,33847,1,1,0,0,0,9.4899999999999998E-2]
[{"$f":"[1]Sheet1!A313","v":"Verlinden, Digna"},{"$f":"[1]Sheet1!B313","v":"8000561"},{"$f":"[1]Sheet1!C313","v":"f"},{"$f":"[1]Sheet1!D313","v":"1964-03-19"},{"$f":"[1]Sheet1!L313","v":"2009-03-23"},"2099-12-31",null,7,7,0.25,0.25,{"$f":"[1]Sheet1!K313","v":89345},{"$f":"[1]Sheet1!I313","v":1},1,{"$f":"[1]Sheet1!M313","v":"2016-06-10"},{"$f":"[1]Sheet1!R313","v":"2023-06-10"},{"$f":"IF(AJ427>0, IF(AJ427<H427, [1]Sheet1!Q313/L427/M427, 0),0)","v":0},{"$f":"IF(AJ427>0, IF(AJ427>=H427, [1]Sheet1!O313/L427/M427 -S427, 0),0)","v":0},{"$f":" IF(AJ427>H427, [1]Sheet1!Q313/L427/M427, 0)","v":0},null,null,null,null,null,null,33847,1,1,0,0,0,9.4899999999999998E-2]
[{"$f":"[1]Sheet1!A314","v":"Verryt, Robert"},{"$f":"[1]Sheet1!B314","v":"8000563"},{"$f":"[1]Sheet1!C314","v":"m"},{"$f":"[1]Sheet1!D314","v":"1954-12-26"},{"$f":"[1]Sheet1!L314","v":"2000-08-21"},"2099-12-31",null,7,7,0.25,0.25,{"$f":"[1]Sheet1!K314","v":111106},{"$f":"[1]Sheet1!I314","v":1},1,{"$f":"[1]Sheet1!M314","v":"2015-03-03"},{"$f":"[1]Sheet1!R314","v":"2022-03-03"},{"$f":"IF(AJ428>0, IF(AJ428<H428, [1]Sheet1!Q314/L428/M428, 0),0)","v":0},{"$f":"IF(AJ428>0, IF(AJ428>=H428, [1]Sheet1!O314/L428/M428 -S428, 0),0)","v":0},{"$f":" IF(AJ428>H428, [1]Sheet1!Q314/L428/M428, 0)","v":0},null,null,null,null,null,null,33847,1,1,0,0,0,9.4899999999999998E-2]
[{"$f":"[1]Sheet1!A315","v":"Visser, Mark J"},{"$f":"[1]Sheet1!B315","v":"8000565"},{"$f":"[1]Sheet1!C315","v":"m"},{"$f":"[1]Sheet1!D315","v":"1956-04-04"},{"$f":"[1]Sheet1!L315","v":"2002-05-20"},"2099-12-31",null,7,7,0.25,0.25,{"$f":"[1]Sheet1!K315","v":64256},{"$f":"[1]Sheet1!I315","v":1},1,{"$f":"[1]Sheet1!M315","v":"2016-11-12"},{"$f":"[1]Sheet1!R315","v":"2023-11-12"},{"$f":"IF(AJ429>0, IF(AJ429<H429, [1]Sheet1!Q315/L429/M429, 0),0)","v":0},{"$f":"IF(AJ429>0, IF(AJ429>=H429, [1]Sheet1!O315/L429/M429 -S429, 0),0)","v":0},{"$f":" IF(AJ429>H429, [1]Sheet1!Q315/L429/M429, 0)","v":0},null,null,null,null,null,null,33847,1,1,0,0,0,9.4899999999999998E-2]
[{"$f":"[1]Sheet1!A316","v":"Vukancic, Martin"},{"$f":"[1]Sheet1!B316","v":"8000566"},{"$f":"[1]Sheet1!C316","v":"m"},{"$f":"[1]Sheet1!D316","v":"1954-01-03"},{"$f":"[1]Sheet1!L316","v":"2013-05-20"},"2099-12-31",null,7,7,0.25,0.25,{"$f":"[1]Sheet1!K316","v":98211},{"$f":"[1]Sheet1!I316","v":1},1,{"$f":"[1]Sheet1!M316","v":"2013-06-22"},{"$f":"[1]Sheet1!R316","v":"2020-06-22"},{"$f":"IF(AJ430>0, IF(AJ430<H430, [1]Sheet1!Q316/L430/M430, 0),0)","v":0},{"$f":"IF(AJ430>0, IF(AJ430>=H430, [1]Sheet1!O316/L430/M430 -S430, 0),0)","v":0},{"$f":" IF(AJ430>H430, [1]Sheet1!Q316/L430/M430, 0)","v":0},null,null,null,null,null,null,33847,1,1,0,0,0,9.4899999999999998E-2]
[{"$f":"[1]Sheet1!A317","v":"Walker, Craig K S"},{"$f":"[1]Sheet1!B317","v":"8000569"},{"$f":"[1]Sheet1!C317","v":"m"},{"$f":"[1]Sheet1!D317","v":"1958-12-06"},{"$f":"[1]Sheet1!L317","v":"1996-01-24"},"2099-12-31",null,7,7,0.25,0.25,{"$f":"[1]Sheet1!K317","v":109590},{"$f":"[1]Sheet1!I317","v":1},1,{"$f":"[1]Sheet1!M317","v":"2010-07-04"},{"$f":"[1]Sheet1!R317","v":"2017-07-04"},{"$f":"IF(AJ431>0, IF(AJ431<H431, [1]Sheet1!Q317/L431/M431, 0),0)","v":0},{"$f":"IF(AJ431>0, IF(AJ431>=H431, [1]Sheet1!O317/L431/M431 -S431, 0),0)","v":0},{"$f":" IF(AJ431>H431, [1]Sheet1!Q317/L431/M431, 0)","v":0},null,null,null,null,null,null,33847,1,1,0,0,0,9.4899999999999998E-2]
[{"$f":"[1]Sheet1!A318","v":"Walker, Glenda E"},{"$f":"[1]Sheet1!B318","v":"8000570"},{"$f":"[1]Sheet1!C318","v":"f"},{"$f":"[1]Sheet1!D318","v":"1959-08-13"},{"$f":"[1]Sheet1!L318","v":"2005-07-18"},"2099-12-31",null,7,7,0.25,0.25,{"$f":"[1]Sheet1!K318","v":103122},{"$f":"[1]Sheet1!I318","v":1},1,{"$f":"[1]Sheet1!M318","v":"2011-12-12"},{"$f":"[1]Sheet1!R318","v":"2018-12-12"},{"$f":"IF(AJ432>0, IF(AJ432<H432, [1]Sheet1!Q318/L432/M432, 0),0)","v":0},{"$f":"IF(AJ432>0, IF(AJ432>=H432, [1]Sheet1!O318/L432/M432 -S432, 0),0)","v":0},{"$f":" IF(AJ432>H432, [1]Sheet1!Q318/L432/M432, 0)","v":0},null,null,null,null,null,null,33847,1,1,0,0,0,9.4899999999999998E-2]
[{"$f":"[1]Sheet1!A319","v":"Wallace, Kathleen M"},{"$f":"[1]Sheet1!B319","v":"8000572"},{"$f":"[1]Sheet1!C319","v":"f"},{"$f":"[1]Sheet1!D319","v":"1963-09-28"},{"$f":"[1]Sheet1!L319","v":"1995-11-27"},"2099-12-31",null,7,7,0.25,0.25,{"$f":"[1]Sheet1!K319","v":115329},{"$f":"[1]Sheet1!I319","v":0.8},0.8,{"$f":"[1]Sheet1!M319","v":"2017-02-13"},{"$f":"[1]Sheet1!R319","v":"2024-02-13"},{"$f":"IF(AJ433>0, IF(AJ433<H433, [1]Sheet1!Q319/L433/M433, 0),0)","v":0},{"$f":"IF(AJ433>0, IF(AJ433>=H433, [1]Sheet1!O319/L433/M433 -S433, 0),0)","v":0},{"$f":" IF(AJ433>H433, [1]Sheet1!Q319/L433/M433, 0)","v":0},null,null,null,null,null,null,33847,1,1,0,0,0,9.4899999999999998E-2]
[{"$f":"[1]Sheet1!A320","v":"Wallace, Lisa M"},{"$f":"[1]Sheet1!B320","v":"8000573"},{"$f":"[1]Sheet1!C320","v":"f"},{"$f":"[1]Sheet1!D320","v":"1967-06-15"},{"$f":"[1]Sheet1!L320","v":"2007-01-08"},"2099-12-31",null,7,7,0.25,0.25,{"$f":"[1]Sheet1!K320","v":105816},{"$f":"[1]Sheet1!I320","v":1},1,{"$f":"[1]Sheet1!M320","v":"2014-05-28"},{"$f":"[1]Sheet1!R320","v":"2021-05-28"},{"$f":"IF(AJ434>0, IF(AJ434<H434, [1]Sheet1!Q320/L434/M434, 0),0)","v":0},{"$f":"IF(AJ434>0, IF(AJ434>=H434, [1]Sheet1!O320/L434/M434 -S434, 0),0)","v":0},{"$f":" IF(AJ434>H434, [1]Sheet1!Q320/L434/M434, 0)","v":0},null,null,null,null,null,null,33847,1,1,0,0,0,9.4899999999999998E-2]
[{"$f":"[1]Sheet1!A321","v":"Walsh, Graeme J"},{"$f":"[1]Sheet1!B321","v":"8000574"},{"$f":"[1]Sheet1!C321","v":"m"},{"$f":"[1]Sheet1!D321","v":"1962-01-23"},{"$f":"[1]Sheet1!L321","v":"1999-11-02"},"2099-12-31",null,7,7,0.25,0.25,{"$f":"[1]Sheet1!K321","v":98211},{"$f":"[1]Sheet1!I321","v":1},1,{"$f":"[1]Sheet1!M321","v":"2010-07-04"},{"$f":"[1]Sheet1!R321","v":"2017-07-04"},{"$f":"IF(AJ435>0, IF(AJ435<H435, [1]Sheet1!Q321/L435/M435, 0),0)","v":0},{"$f":"IF(AJ435>0, IF(AJ435>=H435, [1]Sheet1!O321/L435/M435 -S435, 0),0)","v":0},{"$f":" IF(AJ435>H435, [1]Sheet1!Q321/L435/M435, 0)","v":0},null,null,null,null,null,null,33847,1,1,0,0,0,9.4899999999999998E-2]
[{"$f":"[1]Sheet1!A322","v":"Walsh, Timothy M"},{"$f":"[1]Sheet1!B322","v":"8000575"},{"$f":"[1]Sheet1!C322","v":"m"},{"$f":"[1]Sheet1!D322","v":"1983-04-04"},{"$f":"[1]Sheet1!L322","v":"2014-10-01"},"2099-12-31",null,7,7,0.25,0.25,{"$f":"[1]Sheet1!K322","v":59172},{"$f":"[1]Sheet1!I322","v":1},1,{"$f":"[1]Sheet1!M322","v":"2015-03-03"},{"$f":"[1]Sheet1!R322","v":"2022-03-03"},{"$f":"IF(AJ436>0, IF(AJ436<H436, [1]Sheet1!Q322/L436/M436, 0),0)","v":0},{"$f":"IF(AJ436>0, IF(AJ436>=H436, [1]Sheet1!O322/L436/M436 -S436, 0),0)","v":0},{"$f":" IF(AJ436>H436, [1]Sheet1!Q322/L436/M436, 0)","v":0},null,null,null,null,null,null,33847,1,1,0,0,0,9.4899999999999998E-2]
[{"$f":"[1]Sheet1!A323","v":"Walters, Lester"},{"$f":"[1]Sheet1!B323","v":"8000576"},{"$f":"[1]Sheet1!C323","v":"m"},{"$f":"[1]Sheet1!D323","v":"1959-04-30"},{"$f":"[1]Sheet1!L323","v":"2006-02-14"},"2099-12-31",null,7,7,0.25,0.25,{"$f":"[1]Sheet1!K323","v":109590},{"$f":"[1]Sheet1!I323","v":1},{"$f":"M437","v":1},{"$f":"[1]Sheet1!M323","v":"2014-07-29"},{"$f":"[1]Sheet1!R323","v":"2021-07-29"},{"$f":"IF(AJ437>0, IF(AJ437<H437, [1]Sheet1!Q323/L437/M437, 0),0)","v":0},{"$f":"IF(AJ437>0, IF(AJ437>=H437, [1]Sheet1!O323/L437/M437 -S437, 0),0)","v":0},{"$f":" IF(AJ437>H437, [1]Sheet1!Q323/L437/M437, 0)","v":0},null,null,null,null,null,null,33847,1,1,0,0,0,9.4899999999999998E-2]
[{"$f":"[1]Sheet1!A324","v":"Ward, Lexie E"},{"$f":"[1]Sheet1!B324","v":"8000577"},{"$f":"[1]Sheet1!C324","v":"f"},{"$f":"[1]Sheet1!D324","v":"1959-08-22"},{"$f":"[1]Sheet1!L324","v":"2008-10-13"},"2099-12-31",null,7,7,0.25,0.25,{"$f":"[1]Sheet1!K324","v":111106},{"$f":"[1]Sheet1!I324","v":1},1,{"$f":"[1]Sheet1!M324","v":"2011-02-17"},{"$f":"[1]Sheet1!R324","v":"2018-02-17"},{"$f":"IF(AJ438>0, IF(AJ438<H438, [1]Sheet1!Q324/L438/M438, 0),0)","v":0},{"$f":"IF(AJ438>0, IF(AJ438>=H438, [1]Sheet1!O324/L438/M438 -S438, 0),0)","v":0},{"$f":" IF(AJ438>H438, [1]Sheet1!Q324/L438/M438, 0)","v":0},null,null,null,null,null,null,33847,1,1,0,0,0,9.4899999999999998E-2]
[{"$f":"[1]Sheet1!A325","v":"Ward, Shane R"},{"$f":"[1]Sheet1!B325","v":"8000579"},{"$f":"[1]Sheet1!C325","v":"m"},{"$f":"[1]Sheet1!D325","v":"1967-01-21"},{"$f":"[1]Sheet1!L325","v":"2010-11-08"},"2099-12-31",null,7,7,0.25,0.25,{"$f":"[1]Sheet1!K325","v":98211},{"$f":"[1]Sheet1!I325","v":1},1,{"$f":"[1]Sheet1!M325","v":"2011-02-06"},{"$f":"[1]Sheet1!R325","v":"2018-02-06"},{"$f":"IF(AJ439>0, IF(AJ439<H439, [1]Sheet1!Q325/L439/M439, 0),0)","v":0},{"$f":"IF(AJ439>0, IF(AJ439>=H439, [1]Sheet1!O325/L439/M439 -S439, 0),0)","v":0},{"$f":" IF(AJ439>H439, [1]Sheet1!Q325/L439/M439, 0)","v":0},null,null,null,null,null,null,33847,1,1,0,0,0,9.4899999999999998E-2]
[{"$f":"[1]Sheet1!A326","v":"Warrener, Stacey M"},{"$f":"[1]Sheet1!B326","v":"8000580"},{"$f":"[1]Sheet1!C326","v":"f"},{"$f":"[1]Sheet1!D326","v":"1983-12-20"},{"$f":"[1]Sheet1!L326","v":"2012-04-01"},"2099-12-31",null,7,7,0.25,0.25,{"$f":"[1]Sheet1!K326","v":98211},{"$f":"[1]Sheet1!I326","v":1},1,{"$f":"[1]Sheet1!M326","v":"2012-09-17"},{"$f":"[1]Sheet1!R326","v":"2019-09-17"},{"$f":"IF(AJ440>0, IF(AJ440<H440, [1]Sheet1!Q326/L440/M440, 0),0)","v":0},{"$f":"IF(AJ440>0, IF(AJ440>=H440, [1]Sheet1!O326/L440/M440 -S440, 0),0)","v":0},{"$f":" IF(AJ440>H440, [1]Sheet1!Q326/L440/M440, 0)","v":0},null,null,null,null,null,null,33847,1,1,0,0,0,9.4899999999999998E-2]
[{"$f":"[1]Sheet1!A327","v":"Watson, Alison M"},{"$f":"[1]Sheet1!B327","v":"8000581"},{"$f":"[1]Sheet1!C327","v":"f"},{"$f":"[1]Sheet1!D327","v":"1967-02-17"},{"$f":"[1]Sheet1!L327","v":"2001-11-19"},"2099-12-31",null,7,7,0.25,0.25,{"$f":"[1]Sheet1!K327","v":80797},{"$f":"[1]Sheet1!I327","v":1},1,{"$f":"[1]Sheet1!M327","v":"2016-05-10"},{"$f":"[1]Sheet1!R327","v":"2023-05-10"},{"$f":"IF(AJ441>0, IF(AJ441<H441, [1]Sheet1!Q327/L441/M441, 0),0)","v":0},{"$f":"IF(AJ441>0, IF(AJ441>=H441, [1]Sheet1!O327/L441/M441 -S441, 0),0)","v":0},{"$f":" IF(AJ441>H441, [1]Sheet1!Q327/L441/M441, 0)","v":0},null,null,null,null,null,null,33847,1,1,0,0,0,9.4899999999999998E-2]
[{"$f":"[1]Sheet1!A328","v":"Bass, Lauren H"},{"$f":"[1]Sheet1!B328","v":"8000582"},{"$f":"[1]Sheet1!C328","v":"f"},{"$f":"[1]Sheet1!D328","v":"1984-08-21"},{"$f":"[1]Sheet1!L328","v":"2016-01-11"},"2099-12-31",null,7,7,0.25,0.25,{"$f":"[1]Sheet1!K328","v":72204},{"$f":"[1]Sheet1!I328","v":1},1,{"$f":"[1]Sheet1!M328","v":"2016-03-09"},{"$f":"[1]Sheet1!R328","v":"2023-03-09"},{"$f":"IF(AJ442>0, IF(AJ442<H442, [1]Sheet1!Q328/L442/M442, 0),0)","v":0},{"$f":"IF(AJ442>0, IF(AJ442>=H442, [1]Sheet1!O328/L442/M442 -S442, 0),0)","v":0},{"$f":" IF(AJ442>H442, [1]Sheet1!Q328/L442/M442, 0)","v":0},null,null,null,null,null,null,33847,1,1,0,0,0,9.4899999999999998E-2]
[{"$f":"[1]Sheet1!A329","v":"Watt, Boyton R"},{"$f":"[1]Sheet1!B329","v":"8000583"},{"$f":"[1]Sheet1!C329","v":"m"},{"$f":"[1]Sheet1!D329","v":"1942-08-31"},{"$f":"[1]Sheet1!L329","v":"2005-03-10"},"2099-12-31",null,7,7,0.25,0.25,{"$f":"[1]Sheet1!K329","v":84599},{"$f":"[1]Sheet1!I329","v":1},1,{"$f":"[1]Sheet1!M329","v":"2014-04-27"},{"$f":"[1]Sheet1!R329","v":"2021-04-27"},{"$f":"IF(AJ443>0, IF(AJ443<H443, [1]Sheet1!Q329/L443/M443, 0),0)","v":0},{"$f":"IF(AJ443>0, IF(AJ443>=H443, [1]Sheet1!O329/L443/M443 -S443, 0),0)","v":0},{"$f":" IF(AJ443>H443, [1]Sheet1!Q329/L443/M443, 0)","v":0},null,null,null,null,null,null,33847,1,1,0,0,0,9.4899999999999998E-2]
[{"$f":"[1]Sheet1!A330","v":"Watters, Charlene L"},{"$f":"[1]Sheet1!B330","v":"8000584"},{"$f":"[1]Sheet1!C330","v":"f"},{"$f":"[1]Sheet1!D330","v":"1974-12-03"},{"$f":"[1]Sheet1!L330","v":"2010-04-19"},"2099-12-31",null,7,7,0.25,0.25,{"$f":"[1]Sheet1!K330","v":95709},{"$f":"[1]Sheet1!I330","v":1},1,{"$f":"[1]Sheet1!M330","v":"2010-05-03"},{"$f":"[1]Sheet1!R330","v":"2017-05-03"},{"$f":"IF(AJ444>0, IF(AJ444<H444, [1]Sheet1!Q330/L444/M444, 0),0)","v":0},{"$f":"IF(AJ444>0, IF(AJ444>=H444, [1]Sheet1!O330/L444/M444 -S444, 0),0)","v":0},{"$f":" IF(AJ444>H444, [1]Sheet1!Q330/L444/M444, 0)","v":0},null,null,null,null,null,null,33847,1,1,0,0,0,9.4899999999999998E-2]
[{"$f":"[1]Sheet1!A331","v":"Watts, Karen M"},{"$f":"[1]Sheet1!B331","v":"8000585"},{"$f":"[1]Sheet1!C331","v":"f"},{"$f":"[1]Sheet1!D331","v":"1966-05-14"},{"$f":"[1]Sheet1!L331","v":"2004-04-27"},"2099-12-31",null,7,7,0.25,0.25,{"$f":"[1]Sheet1!K331","v":124033},{"$f":"[1]Sheet1!I331","v":1},1,{"$f":"[1]Sheet1!M331","v":"2013-02-19"},{"$f":"[1]Sheet1!R331","v":"2020-02-19"},{"$f":"IF(AJ445>0, IF(AJ445<H445, [1]Sheet1!Q331/L445/M445, 0),0)","v":0},{"$f":"IF(AJ445>0, IF(AJ445>=H445, [1]Sheet1!O331/L445/M445 -S445, 0),0)","v":0},{"$f":" IF(AJ445>H445, [1]Sheet1!Q331/L445/M445, 0)","v":0},null,null,null,null,null,null,33847,1,1,0,0,0,9.4899999999999998E-2]
[{"$f":"[1]Sheet1!A332","v":"Wight, Brendan"},{"$f":"[1]Sheet1!B332","v":"8000588"},{"$f":"[1]Sheet1!C332","v":"m"},{"$f":"[1]Sheet1!D332","v":"1986-03-01"},{"$f":"[1]Sheet1!L332","v":"2016-09-23"},"2099-12-31",null,7,7,0.25,0.25,{"$f":"[1]Sheet1!K332","v":80797},{"$f":"[1]Sheet1!I332","v":1},1,{"$f":"[1]Sheet1!M332","v":"2012-11-18"},{"$f":"[1]Sheet1!R332","v":"2019-11-18"},{"$f":"IF(AJ446>0, IF(AJ446<H446, [1]Sheet1!Q332/L446/M446, 0),0)","v":0},{"$f":"IF(AJ446>0, IF(AJ446>=H446, [1]Sheet1!O332/L446/M446 -S446, 0),0)","v":0},{"$f":" IF(AJ446>H446, [1]Sheet1!Q332/L446/M446, 0)","v":0},null,null,null,null,null,null,33847,1,1,0,0,0,9.4899999999999998E-2]
[{"$f":"[1]Sheet1!A333","v":"Winterbine, Darren G"},{"$f":"[1]Sheet1!B333","v":"8000593"},{"$f":"[1]Sheet1!C333","v":"m"},{"$f":"[1]Sheet1!D333","v":"1975-03-15"},{"$f":"[1]Sheet1!L333","v":"2011-10-03"},"2099-12-31",null,7,7,0.25,0.25,{"$f":"[1]Sheet1!K333","v":124033},{"$f":"[1]Sheet1!I333","v":1},1,{"$f":"[1]Sheet1!M333","v":"2013-12-14"},{"$f":"[1]Sheet1!R333","v":"2020-12-14"},{"$f":"IF(AJ447>0, IF(AJ447<H447, [1]Sheet1!Q333/L447/M447, 0),0)","v":0},{"$f":"IF(AJ447>0, IF(AJ447>=H447, [1]Sheet1!O333/L447/M447 -S447, 0),0)","v":0},{"$f":" IF(AJ447>H447, [1]Sheet1!Q333/L447/M447, 0)","v":0},null,null,null,null,null,null,33847,1,1,0,0,0,9.4899999999999998E-2]
[{"$f":"[1]Sheet1!A334","v":"Witt, Martin"},{"$f":"[1]Sheet1!B334","v":"8000594"},{"$f":"[1]Sheet1!C334","v":"m"},{"$f":"[1]Sheet1!D334","v":"1959-02-04"},{"$f":"[1]Sheet1!L334","v":"2016-07-16"},"2099-12-31",null,7,7,0.25,0.25,{"$f":"[1]Sheet1!K334","v":94614},{"$f":"[1]Sheet1!I334","v":1},1,{"$f":"[1]Sheet1!M334","v":"2016-09-11"},{"$f":"[1]Sheet1!R334","v":"2023-09-11"},{"$f":"IF(AJ448>0, IF(AJ448<H448, [1]Sheet1!Q334/L448/M448, 0),0)","v":0},{"$f":"IF(AJ448>0, IF(AJ448>=H448, [1]Sheet1!O334/L448/M448 -S448, 0),0)","v":0},{"$f":" IF(AJ448>H448, [1]Sheet1!Q334/L448/M448, 0)","v":0},null,null,null,null,null,null,33847,1,1,0,0,0,9.4899999999999998E-2]
[{"$f":"[1]Sheet1!A335","v":"Wong, Kin T"},{"$f":"[1]Sheet1!B335","v":"8000595"},{"$f":"[1]Sheet1!C335","v":"m"},{"$f":"[1]Sheet1!D335","v":"1962-11-15"},{"$f":"[1]Sheet1!L335","v":"2016-05-06"},"2099-12-31",null,7,7,0.25,0.25,{"$f":"[1]Sheet1!K335","v":124033},{"$f":"[1]Sheet1!I335","v":1},1,{"$f":"[1]Sheet1!M335","v":"2014-04-27"},{"$f":"[1]Sheet1!R335","v":"2021-04-27"},{"$f":"IF(AJ449>0, IF(AJ449<H449, [1]Sheet1!Q335/L449/M449, 0),0)","v":0},{"$f":"IF(AJ449>0, IF(AJ449>=H449, [1]Sheet1!O335/L449/M449 -S449, 0),0)","v":0},{"$f":" IF(AJ449>H449, [1]Sheet1!Q335/L449/M449, 0)","v":0},null,null,null,null,null,null,33847,1,1,0,0,0,9.4899999999999998E-2]
[{"$f":"[1]Sheet1!A336","v":"Wooding, Louise C"},{"$f":"[1]Sheet1!B336","v":"8000598"},{"$f":"[1]Sheet1!C336","v":"f"},{"$f":"[1]Sheet1!D336","v":"1975-10-11"},{"$f":"[1]Sheet1!L336","v":"2012-01-09"},"2099-12-31",null,7,7,0.25,0.25,{"$f":"[1]Sheet1!K336","v":62482},{"$f":"[1]Sheet1!I336","v":1},1,{"$f":"[1]Sheet1!M336","v":"2012-02-12"},{"$f":"[1]Sheet1!R336","v":"2019-02-12"},{"$f":"IF(AJ450>0, IF(AJ450<H450, [1]Sheet1!Q336/L450/M450, 0),0)","v":0},{"$f":"IF(AJ450>0, IF(AJ450>=H450, [1]Sheet1!O336/L450/M450 -S450, 0),0)","v":0},{"$f":" IF(AJ450>H450, [1]Sheet1!Q336/L450/M450, 0)","v":0},null,null,null,null,null,null,33847,1,1,0,0,0,9.4899999999999998E-2]
[{"$f":"[1]Sheet1!A337","v":"Woodvine, Sidney J"},{"$f":"[1]Sheet1!B337","v":"8000599"},{"$f":"[1]Sheet1!C337","v":"m"},{"$f":"[1]Sheet1!D337","v":"1956-11-01"},{"$f":"[1]Sheet1!L337","v":"2004-09-20"},"2099-12-31",null,7,7,0.25,0.25,{"$f":"[1]Sheet1!K337","v":92205},{"$f":"[1]Sheet1!I337","v":1},1,{"$f":"[1]Sheet1!M337","v":"2012-05-16"},{"$f":"[1]Sheet1!R337","v":"2019-05-16"},{"$f":"IF(AJ451>0, IF(AJ451<H451, [1]Sheet1!Q337/L451/M451, 0),0)","v":0},{"$f":"IF(AJ451>0, IF(AJ451>=H451, [1]Sheet1!O337/L451/M451 -S451, 0),0)","v":0},{"$f":" IF(AJ451>H451, [1]Sheet1!Q337/L451/M451, 0)","v":0},null,null,null,null,null,null,33847,1,1,0,0,0,9.4899999999999998E-2]
[{"$f":"[1]Sheet1!A338","v":"Ybarsabal, Juliet"},{"$f":"[1]Sheet1!B338","v":"8000601"},{"$f":"[1]Sheet1!C338","v":"f"},{"$f":"[1]Sheet1!D338","v":"1979-01-12"},{"$f":"[1]Sheet1!L338","v":"2015-03-25"},"2099-12-31",null,7,7,0.25,0.25,{"$f":"[1]Sheet1!K338","v":48139.4},{"$f":"[1]Sheet1!I338","v":1},1,{"$f":"[1]Sheet1!M338","v":"2015-11-15"},{"$f":"[1]Sheet1!R338","v":"2022-11-15"},{"$f":"IF(AJ452>0, IF(AJ452<H452, [1]Sheet1!Q338/L452/M452, 0),0)","v":0},{"$f":"IF(AJ452>0, IF(AJ452>=H452, [1]Sheet1!O338/L452/M452 -S452, 0),0)","v":0},{"$f":" IF(AJ452>H452, [1]Sheet1!Q338/L452/M452, 0)","v":0},null,null,null,null,null,null,33847,1,1,0,0,0,9.4899999999999998E-2]
[{"$f":"[1]Sheet1!A339","v":"Zampichelli, Lina"},{"$f":"[1]Sheet1!B339","v":"8000603"},{"$f":"[1]Sheet1!C339","v":"f"},{"$f":"[1]Sheet1!D339","v":"1953-11-20"},{"$f":"[1]Sheet1!L339","v":"1996-07-22"},"2099-12-31",null,7,7,0.25,0.25,{"$f":"[1]Sheet1!K339","v":98211},{"$f":"[1]Sheet1!I339","v":1},1,{"$f":"[1]Sheet1!M339","v":"2011-03-09"},{"$f":"[1]Sheet1!R339","v":"2018-03-09"},{"$f":"IF(AJ453>0, IF(AJ453<H453, [1]Sheet1!Q339/L453/M453, 0),0)","v":0},{"$f":"IF(AJ453>0, IF(AJ453>=H453, [1]Sheet1!O339/L453/M453 -S453, 0),0)","v":0},{"$f":" IF(AJ453>H453, [1]Sheet1!Q339/L453/M453, 0)","v":0},null,null,null,null,null,null,33847,1,1,0,0,0,9.4899999999999998E-2]
[{"$f":"[1]Sheet1!A340","v":"Zatella, Amanda"},{"$f":"[1]Sheet1!B340","v":"8000604"},{"$f":"[1]Sheet1!C340","v":"f"},{"$f":"[1]Sheet1!D340","v":"1991-04-09"},{"$f":"[1]Sheet1!L340","v":"2011-03-18"},"2099-12-31",null,7,7,0.25,0.25,{"$f":"[1]Sheet1!K340","v":64256},{"$f":"[1]Sheet1!I340","v":1},1,{"$f":"[1]Sheet1!M340","v":"2011-04-09"},{"$f":"[1]Sheet1!R340","v":"2018-04-09"},{"$f":"IF(AJ454>0, IF(AJ454<H454, [1]Sheet1!Q340/L454/M454, 0),0)","v":0},{"$f":"IF(AJ454>0, IF(AJ454>=H454, [1]Sheet1!O340/L454/M454 -S454, 0),0)","v":0},{"$f":" IF(AJ454>H454, [1]Sheet1!Q340/L454/M454, 0)","v":0},null,null,null,null,null,null,33847,1,1,0,0,0,9.4899999999999998E-2]
[{"$f":"[1]Sheet1!A341","v":"Cooper, Jane L"},{"$f":"[1]Sheet1!B341","v":8000122},{"$f":"[1]Sheet1!C341","v":"f"},{"$f":"[1]Sheet1!D341","v":"1975-05-04"},{"$f":"[1]Sheet1!L341","v":"1998-09-16"},"2099-12-31",null,7,7,0.25,0.25,{"$f":"[1]Sheet1!K341","v":64256},{"$f":"[1]Sheet1!I341","v":0.8},0.8,{"$f":"[1]Sheet1!M341","v":"2015-02-03"},{"$f":"[1]Sheet1!R341","v":"2022-02-03"},{"$f":"IF(AJ455>0, IF(AJ455<H455, [1]Sheet1!Q341/L455/M455, 0),0)","v":0},{"$f":"IF(AJ455>0, IF(AJ455>=H455, [1]Sheet1!O341/L455/M455 -S455, 0),0)","v":0},{"$f":" IF(AJ455>H455, [1]Sheet1!Q341/L455/M455, 0)","v":0},null,null,null,null,null,null,33847,1,1,0,0,0,9.4899999999999998E-2]
[{"$f":"[1]Sheet1!A342","v":"Edwards, Kelly L"},{"$f":"[1]Sheet1!B342","v":8000177},{"$f":"[1]Sheet1!C342","v":"f"},{"$f":"[1]Sheet1!D342","v":"1969-05-28"},{"$f":"[1]Sheet1!L342","v":"1993-02-03"},"2099-12-31",null,7,7,0.25,0.25,{"$f":"[1]Sheet1!K342","v":124033},{"$f":"[1]Sheet1!I342","v":0.8374666999999999},0.8374666999999999,{"$f":"[1]Sheet1!M342","v":"2015-12-08"},{"$f":"[1]Sheet1!R342","v":"2022-12-08"},{"$f":"IF(AJ456>0, IF(AJ456<H456, [1]Sheet1!Q342/L456/M456, 0),0)","v":0},{"$f":"IF(AJ456>0, IF(AJ456>=H456, [1]Sheet1!O342/L456/M456 -S456, 0),0)","v":0},{"$f":" IF(AJ456>H456, [1]Sheet1!Q342/L456/M456, 0)","v":0},null,null,null,null,null,null,33847,1,1,0,0,0,9.4899999999999998E-2]
[{"$f":"[1]Sheet1!A343","v":"Edwards, Martyn N"},{"$f":"[1]Sheet1!B343","v":8000178},{"$f":"[1]Sheet1!C343","v":"m"},{"$f":"[1]Sheet1!D343","v":"1969-11-17"},{"$f":"[1]Sheet1!L343","v":"1992-01-28"},"2099-12-31",null,7,7,0.25,0.25,{"$f":"[1]Sheet1!K343","v":124033},{"$f":"[1]Sheet1!I343","v":1},1,{"$f":"[1]Sheet1!M343","v":"2016-06-21"},{"$f":"[1]Sheet1!R343","v":"2023-06-21"},{"$f":"IF(AJ457>0, IF(AJ457<H457, [1]Sheet1!Q343/L457/M457, 0),0)","v":0},{"$f":"IF(AJ457>0, IF(AJ457>=H457, [1]Sheet1!O343/L457/M457 -S457, 0),0)","v":0},{"$f":" IF(AJ457>H457, [1]Sheet1!Q343/L457/M457, 0)","v":0},null,null,null,null,null,null,33847,1,1,0,0,0,9.4899999999999998E-2]
[{"$f":"[1]Sheet1!A344","v":"Franich, Nadia S"},{"$f":"[1]Sheet1!B344","v":8000210},{"$f":"[1]Sheet1!C344","v":"f"},{"$f":"[1]Sheet1!D344","v":"1978-02-10"},{"$f":"[1]Sheet1!L344","v":"2015-04-01"},"2099-12-31",null,7,7,0.25,0.25,{"$f":"[1]Sheet1!K344","v":81502},{"$f":"[1]Sheet1!I344","v":1},1,{"$f":"[1]Sheet1!M344","v":"2011-01-01"},{"$f":"[1]Sheet1!R344","v":"2018-01-01"},{"$f":"IF(AJ458>0, IF(AJ458<H458, [1]Sheet1!Q344/L458/M458, 0),0)","v":0},{"$f":"IF(AJ458>0, IF(AJ458>=H458, [1]Sheet1!O344/L458/M458 -S458, 0),0)","v":0},{"$f":" IF(AJ458>H458, [1]Sheet1!Q344/L458/M458, 0)","v":0},null,null,null,null,null,null,33847,1,1,0,0,0,9.4899999999999998E-2]
[{"$f":"[1]Sheet1!A345","v":"Fru, Chibikom S"},{"$f":"[1]Sheet1!B345","v":8000215},{"$f":"[1]Sheet1!C345","v":"m"},{"$f":"[1]Sheet1!D345","v":"1977-12-18"},{"$f":"[1]Sheet1!L345","v":"2015-04-01"},"2099-12-31",null,7,7,0.25,0.25,{"$f":"[1]Sheet1!K345","v":48139.4},{"$f":"[1]Sheet1!I345","v":0.5},0.5,{"$f":"[1]Sheet1!M345","v":"2011-12-15"},{"$f":"[1]Sheet1!R345","v":"2018-12-15"},{"$f":"IF(AJ459>0, IF(AJ459<H459, [1]Sheet1!Q345/L459/M459, 0),0)","v":0},{"$f":"IF(AJ459>0, IF(AJ459>=H459, [1]Sheet1!O345/L459/M459 -S459, 0),0)","v":0},{"$f":" IF(AJ459>H459, [1]Sheet1!Q345/L459/M459, 0)","v":0},null,null,null,null,null,null,33847,1,1,0,0,0,9.4899999999999998E-2]
[{"$f":"[1]Sheet1!A346","v":"Grundy, Danni S"},{"$f":"[1]Sheet1!B346","v":8000256},{"$f":"[1]Sheet1!C346","v":"f"},{"$f":"[1]Sheet1!D346","v":"1980-08-11"},{"$f":"[1]Sheet1!L346","v":"2006-05-02"},"2099-12-31",null,7,7,0.25,0.25,{"$f":"[1]Sheet1!K346","v":103122},{"$f":"[1]Sheet1!I346","v":1},1,{"$f":"[1]Sheet1!M346","v":"2014-04-04"},{"$f":"[1]Sheet1!R346","v":"2021-04-04"},{"$f":"IF(AJ460>0, IF(AJ460<H460, [1]Sheet1!Q346/L460/M460, 0),0)","v":0},{"$f":"IF(AJ460>0, IF(AJ460>=H460, [1]Sheet1!O346/L460/M460 -S460, 0),0)","v":0},{"$f":" IF(AJ460>H460, [1]Sheet1!Q346/L460/M460, 0)","v":0},null,null,null,null,null,null,33847,1,1,0,0,0,9.4899999999999998E-2]
[{"$f":"[1]Sheet1!A347","v":"Koltasz, Esme B"},{"$f":"[1]Sheet1!B347","v":8000326},{"$f":"[1]Sheet1!C347","v":"f"},{"$f":"[1]Sheet1!D347","v":"1981-04-07"},{"$f":"[1]Sheet1!L347","v":"2002-11-04"},"2099-12-31",null,7,7,0.25,0.25,{"$f":"[1]Sheet1!K347","v":57376},{"$f":"[1]Sheet1!I347","v":0.4},0.4,{"$f":"[1]Sheet1!M347","v":"2013-05-16"},{"$f":"[1]Sheet1!R347","v":"2020-05-16"},{"$f":"IF(AJ461>0, IF(AJ461<H461, [1]Sheet1!Q347/L461/M461, 0),0)","v":0},{"$f":"IF(AJ461>0, IF(AJ461>=H461, [1]Sheet1!O347/L461/M461 -S461, 0),0)","v":0},{"$f":" IF(AJ461>H461, [1]Sheet1!Q347/L461/M461, 0)","v":0},null,null,null,null,null,null,33847,1,1,0,0,0,9.4899999999999998E-2]
[{"$f":"[1]Sheet1!A348","v":"Masenda, Musa"},{"$f":"[1]Sheet1!B348","v":8000613},{"$f":"[1]Sheet1!C348","v":"f"},{"$f":"[1]Sheet1!D348","v":"1967-10-03"},{"$f":"[1]Sheet1!L348","v":"2016-10-01"},"2099-12-31",null,7,7,0.25,0.25,{"$f":"[1]Sheet1!K348","v":94614},{"$f":"[1]Sheet1!I348","v":1},1,{"$f":"[1]Sheet1!M348","v":"2012-01-11"},{"$f":"[1]Sheet1!R348","v":"2019-01-11"},{"$f":"IF(AJ462>0, IF(AJ462<H462, [1]Sheet1!Q348/L462/M462, 0),0)","v":0},{"$f":"IF(AJ462>0, IF(AJ462>=H462, [1]Sheet1!O348/L462/M462 -S462, 0),0)","v":0},{"$f":" IF(AJ462>H462, [1]Sheet1!Q348/L462/M462, 0)","v":0},null,null,null,null,null,null,33847,1,1,0,0,0,9.4899999999999998E-2]
[{"$f":"[1]Sheet1!A349","v":"McEwan, Kevin"},{"$f":"[1]Sheet1!B349","v":8000372},{"$f":"[1]Sheet1!C349","v":"m"},{"$f":"[1]Sheet1!D349","v":"1964-06-04"},{"$f":"[1]Sheet1!L349","v":"2008-05-16"},"2099-12-31",null,7,7,0.25,0.25,{"$f":"[1]Sheet1!K349","v":88830},{"$f":"[1]Sheet1!I349","v":1},1,{"$f":"[1]Sheet1!M349","v":"2016-08-19"},{"$f":"[1]Sheet1!R349","v":"2023-08-19"},{"$f":"IF(AJ463>0, IF(AJ463<H463, [1]Sheet1!Q349/L463/M463, 0),0)","v":0},{"$f":"IF(AJ463>0, IF(AJ463>=H463, [1]Sheet1!O349/L463/M463 -S463, 0),0)","v":0},{"$f":" IF(AJ463>H463, [1]Sheet1!Q349/L463/M463, 0)","v":0},null,null,null,null,null,null,33847,1,1,0,0,0,9.4899999999999998E-2]
[{"$f":"[1]Sheet1!A350","v":"O'Loughlin, Angie L"},{"$f":"[1]Sheet1!B350","v":8000423},{"$f":"[1]Sheet1!C350","v":"f"},{"$f":"[1]Sheet1!D350","v":"1974-05-27"},{"$f":"[1]Sheet1!L350","v":"2001-03-12"},"2099-12-31",null,7,7,0.25,0.25,{"$f":"[1]Sheet1!K350","v":64256},{"$f":"[1]Sheet1!I350","v":0.5},0.5,{"$f":"[1]Sheet1!M350","v":"2016-03-06"},{"$f":"[1]Sheet1!R350","v":"2023-03-06"},{"$f":"IF(AJ464>0, IF(AJ464<H464, [1]Sheet1!Q350/L464/M464, 0),0)","v":0},{"$f":"IF(AJ464>0, IF(AJ464>=H464, [1]Sheet1!O350/L464/M464 -S464, 0),0)","v":0},{"$f":" IF(AJ464>H464, [1]Sheet1!Q350/L464/M464, 0)","v":0},null,null,null,null,null,null,33847,1,1,0,0,0,9.4899999999999998E-2]
[{"$f":"[1]Sheet1!A351","v":"Payne, Joanne"},{"$f":"[1]Sheet1!B351","v":8000438},{"$f":"[1]Sheet1!C351","v":"f"},{"$f":"[1]Sheet1!D351","v":"1960-03-09"},{"$f":"[1]Sheet1!L351","v":"1992-02-03"},"2099-12-31",null,7,7,0.25,0.25,{"$f":"[1]Sheet1!K351","v":142609},{"$f":"[1]Sheet1!I351","v":1},1,{"$f":"[1]Sheet1!M351","v":"2014-03-09"},{"$f":"[1]Sheet1!R351","v":"2021-03-09"},{"$f":"IF(AJ465>0, IF(AJ465<H465, [1]Sheet1!Q351/L465/M465, 0),0)","v":0},{"$f":"IF(AJ465>0, IF(AJ465>=H465, [1]Sheet1!O351/L465/M465 -S465, 0),0)","v":0},{"$f":" IF(AJ465>H465, [1]Sheet1!Q351/L465/M465, 0)","v":0},null,null,null,null,null,null,33847,1,1,0,0,0,9.4899999999999998E-2]
[{"$f":"[1]Sheet1!A352","v":"Querino, Rangimaringi"},{"$f":"[1]Sheet1!B352","v":8000452},{"$f":"[1]Sheet1!C352","v":"f"},{"$f":"[1]Sheet1!D352","v":"1956-08-12"},{"$f":"[1]Sheet1!L352","v":"2008-03-05"},"2099-12-31",null,7,7,0.25,0.25,{"$f":"[1]Sheet1!K352","v":101943},{"$f":"[1]Sheet1!I352","v":1},1,{"$f":"[1]Sheet1!M352","v":"2016-01-09"},{"$f":"[1]Sheet1!R352","v":"2023-01-09"},{"$f":"IF(AJ466>0, IF(AJ466<H466, [1]Sheet1!Q352/L466/M466, 0),0)","v":0},{"$f":"IF(AJ466>0, IF(AJ466>=H466, [1]Sheet1!O352/L466/M466 -S466, 0),0)","v":0},{"$f":" IF(AJ466>H466, [1]Sheet1!Q352/L466/M466, 0)","v":0},null,null,null,null,null,null,33847,1,1,0,0,0,9.4899999999999998E-2]
[{"$f":"[1]Sheet1!A353","v":"Ralph, Roberta A"},{"$f":"[1]Sheet1!B353","v":8000456},{"$f":"[1]Sheet1!C353","v":"f"},{"$f":"[1]Sheet1!D353","v":"1972-09-03"},{"$f":"[1]Sheet1!L353","v":"1998-02-02"},"2099-12-31",null,7,7,0.25,0.25,{"$f":"[1]Sheet1!K353","v":73717},{"$f":"[1]Sheet1!I353","v":0.5},0.5,{"$f":"[1]Sheet1!M353","v":"2014-01-05"},{"$f":"[1]Sheet1!R353","v":"2021-01-05"},{"$f":"IF(AJ467>0, IF(AJ467<H467, [1]Sheet1!Q353/L467/M467, 0),0)","v":0},{"$f":"IF(AJ467>0, IF(AJ467>=H467, [1]Sheet1!O353/L467/M467 -S467, 0),0)","v":0},{"$f":" IF(AJ467>H467, [1]Sheet1!Q353/L467/M467, 0)","v":0},null,null,null,null,null,null,33847,1,1,0,0,0,9.4899999999999998E-2]
[{"$f":"[1]Sheet1!A354","v":"Rogers, Kiah F"},{"$f":"[1]Sheet1!B354","v":8000477},{"$f":"[1]Sheet1!C354","v":"f"},{"$f":"[1]Sheet1!D354","v":"1966-01-27"},{"$f":"[1]Sheet1!L354","v":"1999-05-07"},"2099-12-31",null,7,7,0.25,0.25,{"$f":"[1]Sheet1!K354","v":80797},{"$f":"[1]Sheet1!I354","v":1},1,{"$f":"[1]Sheet1!M354","v":"2015-06-19"},{"$f":"[1]Sheet1!R354","v":"2022-06-19"},{"$f":"IF(AJ468>0, IF(AJ468<H468, [1]Sheet1!Q354/L468/M468, 0),0)","v":0},{"$f":"IF(AJ468>0, IF(AJ468>=H468, [1]Sheet1!O354/L468/M468 -S468, 0),0)","v":0},{"$f":" IF(AJ468>H468, [1]Sheet1!Q354/L468/M468, 0)","v":0},null,null,null,null,null,null,33847,1,1,0,0,0,9.4899999999999998E-2]
[{"$f":"[1]Sheet1!A355","v":"Tamati, Phillip"},{"$f":"[1]Sheet1!B355","v":8000531},{"$f":"[1]Sheet1!C355","v":"m"},{"$f":"[1]Sheet1!D355","v":"1954-03-20"},{"$f":"[1]Sheet1!L355","v":"2014-01-27"},"2099-12-31",null,7,7,0.25,0.25,{"$f":"[1]Sheet1!K355","v":78517},{"$f":"[1]Sheet1!I355","v":1},1,{"$f":"[1]Sheet1!M355","v":"2010-02-26"},{"$f":"[1]Sheet1!R355","v":"2017-02-26"},{"$f":"IF(AJ469>0, IF(AJ469<H469, [1]Sheet1!Q355/L469/M469, 0),0)","v":0},{"$f":"IF(AJ469>0, IF(AJ469>=H469, [1]Sheet1!O355/L469/M469 -S469, 0),0)","v":0},{"$f":" IF(AJ469>H469, [1]Sheet1!Q355/L469/M469, 0)","v":0},null,null,null,null,null,null,33847,1,1,0,0,0,9.4899999999999998E-2]
[{"$f":"[1]Sheet1!A356","v":"Toomey, Noeleen G"},{"$f":"[1]Sheet1!B356","v":8000545},{"$f":"[1]Sheet1!C356","v":"f"},{"$f":"[1]Sheet1!D356","v":"1964-06-02"},{"$f":"[1]Sheet1!L356","v":"1995-01-23"},"2099-12-31",null,7,7,0.25,0.25,{"$f":"[1]Sheet1!K356","v":57376},{"$f":"[1]Sheet1!I356","v":1},1,{"$f":"[1]Sheet1!M356","v":"2017-02-21"},{"$f":"[1]Sheet1!R356","v":"2024-02-21"},{"$f":"IF(AJ470>0, IF(AJ470<H470, [1]Sheet1!Q356/L470/M470, 0),0)","v":0},{"$f":"IF(AJ470>0, IF(AJ470>=H470, [1]Sheet1!O356/L470/M470 -S470, 0),0)","v":0},{"$f":" IF(AJ470>H470, [1]Sheet1!Q356/L470/M470, 0)","v":0},null,null,null,null,null,null,33847,1,1,0,0,0,9.4899999999999998E-2]
[{"$f":"[1]Sheet1!A357","v":0},{"$f":"[1]Sheet1!B357","v":0},{"$f":"[1]Sheet1!C357","v":"00:00:00"},{"$f":"[1]Sheet1!D357","v":"00:00:00"},{"$f":"[1]Sheet1!L357","v":"00:00:00"},"2099-12-31",null,7,7,0.25,0.25,{"$f":"[1]Sheet1!K357","v":0},{"$f":"[1]Sheet1!I357","v":0},0,{"$f":"[1]Sheet1!M357","v":"00:00:00"},{"$f":"[1]Sheet1!R357","v":"00:00:00"},{"$f":"IF(AJ471>0, IF(AJ471<H471, [1]Sheet1!Q357/L471/M471, 0),0)","v":0},{"$f":"IF(AJ471>0, IF(AJ471>=H471, [1]Sheet1!O357/L471/M471 -S471, 0),0)","v":0},{"$f":" IF(AJ471>H471, [1]Sheet1!Q357/L471/M471, 0)","v":0},null,null,null,null,null,null,33847,1,1,0,0,0,9.4899999999999998E-2]
[{"$f":"[1]Sheet1!A358","v":0},{"$f":"[1]Sheet1!B358","v":0},{"$f":"[1]Sheet1!C358","v":"00:00:00"},{"$f":"[1]Sheet1!D358","v":"00:00:00"},{"$f":"[1]Sheet1!L358","v":"00:00:00"},"2099-12-31",null,7,7,0.25,0.25,{"$f":"[1]Sheet1!K358","v":0},{"$f":"[1]Sheet1!I358","v":0},0,{"$f":"[1]Sheet1!M358","v":"00:00:00"},{"$f":"[1]Sheet1!R358","v":"00:00:00"},{"$f":"IF(AJ472>0, IF(AJ472<H472, [1]Sheet1!Q358/L472/M472, 0),0)","v":0},{"$f":"IF(AJ472>0, IF(AJ472>=H472, [1]Sheet1!O358/L472/M472 -S472, 0),0)","v":{"$error":"#DIV/0!"}},{"$f":" IF(AJ472>H472, [1]Sheet1!Q358/L472/M472, 0)","v":{"$error":"#DIV/0!"}},null,null,null,null,null,null,33847,1,1,0,0,0,9.4899999999999998E-2,1,117.00277777777778,{"$error":"#DIV/0!"},117.00277777777778,{"$error":"#DIV/0!"},1,116.00277777777778]
[{"$f":"[1]Sheet1!A359","v":0},{"$f":"[1]Sheet1!B359","v":0},{"$f":"[1]Sheet1!C359","v":"00:00:00"},{"$f":"[1]Sheet1!D359","v":"00:00:00"},{"$f":"[1]Sheet1!L359","v":"00:00:00"},"2099-12-31",null,7,7,0.25,0.25,{"$f":"[1]Sheet1!K359","v":0},{"$f":"[1]Sheet1!I359","v":0},0,{"$f":"[1]Sheet1!M359","v":"00:00:00"},{"$f":"[1]Sheet1!R359","v":"00:00:00"},{"$f":"IF(AJ473>0, IF(AJ473<H473, [1]Sheet1!Q359/L473/M473, 0),0)","v":0},{"$f":"IF(AJ473>0, IF(AJ473>=H473, [1]Sheet1!O359/L473/M473 -S473, 0),0)","v":{"$error":"#DIV/0!"}},{"$f":" IF(AJ473>H473, [1]Sheet1!Q359/L473/M473, 0)","v":{"$error":"#DIV/0!"}},null,null,null,null,null,null,null,null,null,null,null,null,null,{"$f":"IF($E473<=ValDate,1,0) * IF($F473>ValDate,1,IF($F473=0,1,0))","v":1},117.00277777777778,{"$error":"#DIV/0!"},117.00277777777778,{"$error":"#DIV/0!"},{"$f":"IF($E473<=LastYear,1,0) * IF($F473>LastYear,1,IF($F473=0,1,0))","v":1},116.00277777777778]
["All",{"$f":"COUNT(D116:D473)","v":358},{"$f":"TEXT(SUM(IF(C116:C473=\"M\",1,0))/(ROW(B474)-ROW(DataStart)),\"##.#%\") & \" male\"","v":"39.4% male"},null,null,null,{"$f":"SUM(G116:G473)","v":0},{"$f":"SUM(H111:H473)","v":2506},{"$f":"SUM(I111:I473)","v":2506},{"$f":"SUM(J111:J473)","v":89.5},{"$f":"SUM(K111:K473)","v":89.5},{"$f":"SUM(L116:L473)","v":31115605.969999991},325.4471982789475,325.4471982789475,{"$f":"SUM(O116:O473)","v":14769923},null,4.7145622655190031,{"$error":"#DIV/0!"},{"$error":"#DIV/0!"},{"$f":"SUM(T116:T473)","v":4.8958392009360505},0,0,0,0,0,11696292,357,357,1.7038116877674845,1.4804620267916877,1.7748441654302272,33.879299999999972,71,3595.2361111111099,{"$error":"#DIV/0!"},741.57222222222219,{"$error":"#DIV/0!"},64,3183.5694444444439]
["Minimum",null,null,{"$f":"MIN(D$116:D$473)","v":"00:00:00"},{"$f":"MIN(E$116:E$473)","v":"00:00:00"},{"$f":"MIN(IF(F$116:F$473>0,F$116:F$473,DATE(2099,12,31)))","v":"2099-12-31"},{"$f":"MIN(G$116:G$473)","v":0},{"$f":"MIN(H$111:H$473)","v":7},{"$f":"MIN(I$111:I$473)","v":7},{"$f":"MIN(J$111:J$473)","v":0.25},{"$f":"MIN(K$111:K$473)","v":0.25},{"$f":"MIN(L$116:L$473)","v":0},0,0,0,{"$f":"MIN(IF(P$116:P$473>0,P$116:P$473,DATE(2099,12,31)))","v":"2017-01-16"},0,{"$error":"#DIV/0!"},{"$error":"#DIV/0!"},4.8958392009360505,0,0,0,0,0,6440,1,1,0,0,0,9.4899999999999998E-2,1,{"$f":"MIN(IF($AG$116:$AG473=1,AH$116:AH$473,9999999))","v":29.333333333333332},{"$f":"MIN(IF($AG$116:$AG473=1,AI$116:AI$473,9999999))","v":{"$error":"#DIV/0!"}},{"$f":"MIN(IF($AG$116:$AG473=1,AJ$116:AJ$473,9999999))","v":0.28333333333333333},{"$f":"MIN(IF($AG$116:$AG473=1,AK$116:AK$473,9999999))","v":{"$error":"#DIV/0!"}},{"$f":"MIN(AL$116:AL$473)","v":0},{"$f":"MIN(AM$116:AM$473)","v":0}]
["Maximum",null,null,{"$f":"MAX(D$116:D$473)","v":"1995-03-01"},{"$f":"MAX(E$116:E$473)","v":"2016-10-01"},{"$f":"MAX(IF(F$116:F$473<=ValDate,F$116:F$473,0))","v":"00:00:00"},{"$f":"MAX(G$116:G$473)","v":0},{"$f":"MAX(H$111:H$473)","v":7},{"$f":"MAX(I$111:I$473)","v":7},{"$f":"MAX(J$111:J$473)","v":0.25},{"$f":"MAX(K$111:K$473)","v":0.25},{"$f":"MAX(L$116:L$473)","v":215000},1,1,42787,{"$f":"MAX(IF(P$116:P$473<=ValDate,P$116:P$473,0))","v":"00:00:00"},0.24764399399535714,{"$error":"#DIV/0!"},{"$error":"#DIV/0!"},4.8958392009360505,0,0,0,0,0,54486,1,1,0.2543478260869565,0.25,0.2543478260869565,9.4899999999999998E-2,1,{"$f":"MAX(IF($AG$116:$AG473=1,AH$116:AH$473,0))","v":117.00277777777778},{"$f":"MAX(IF($AG$116:$AG473=1,AI$116:AI$473,0))","v":{"$error":"#DIV/0!"}},{"$f":"MAX(IF($AG$116:$AG473=1,AJ$116:AJ$473,0))","v":117.00277777777778},{"$f":"MAX(IF($AG$116:$AG473=1,AK$116:AK$473,0))","v":{"$error":"#DIV/0!"}},{"$f":"MAX(AL$116:AL$473)","v":1},{"$f":"MAX(AM$116:AM$473)","v":116.00277777777778}]
["Average",null,null,{"$f":"IF(COUNT(D116:D473)>0,SUM(D116:D473)/COUNT(D116:D473),0)","v":"1968-05-11T19:26:28.827"},{"$f":"IF(COUNT(E116:E473)>0,SUM(E116:E473)/COUNT(E116:E473),0)","v":"2008-02-22T20:50:56.983"},{"$f":"IF(COUNT(F116:F473)>0,SUM(F116:F473)/COUNT(F116:F473),0)","v":"2099-12-31"},{"$f":"IF(COUNT(G116:G473)>0,SUM(G116:G473)/COUNT(G116:G473),0)","v":0},{"$f":"IF(COUNT(H111:H473)>0,SUM(H111:H473)/COUNT(H111:H473),0)","v":7},{"$f":"IF(COUNT(I111:I473)>0,SUM(I111:I473)/COUNT(I111:I473),0)","v":7},{"$f":"IF(COUNT(J111:J473)>0,SUM(J111:J473)/COUNT(J111:J473),0)","v":0.25},{"$f":"IF(COUNT(K111:K473)>0,SUM(K111:K473)/COUNT(K111:K473),0)","v":0.25},{"$f":"IF(COUNT(L116:L473)>0,SUM(L116:L473)/COUNT(L116:L473),0)","v":86915.100474860315},0.90907038625404324,0.90907038625404324,{"$f":"IF(COUNT(O116:O473)>0,SUM(O116:O473)/COUNT(O116:O473),0)","v":41256.76815642458},{"$f":"IF(COUNT(P116:P473)>0,SUM(P116:P473)/COUNT(P116:P473),0)","v":"2019-11-23T01:28:29.497"},1.3169168339438556E-2,{"$error":"#DIV/0!"},{"$error":"#DIV/0!"},{"$f":"IF(COUNT(T116:T473)>0,SUM(T116:T473)/COUNT(T116:T473),0)","v":4.8958392009360505},0,{"$f":"IF(COUNT(V116:V473)>0,SUM(V116:V473)/COUNT(V116:V473),0)","v":0},0,0,0,32762.722689075632,1,1,4.7725817584523371E-3,4.1469524559991254E-3,4.9715522841182833E-3,9.4899999999999929E-2,1,{"$f":"IF($AG$474>0,SUM(IF($AG$116:$AG473=1,AH116:AH473,0))/$AG$474,0)","v":50.637128325508591},{"$f":"IF($AG$474>0,SUM(IF($AG$116:$AG473=1,AI116:AI473,0))/$AG$474,0)","v":{"$error":"#DIV/0!"}},{"$f":"IF($AG$474>0,SUM(IF($AG$116:$AG473=1,AJ116:AJ473,0))/$AG$474,0)","v":10.444679186228482},{"$f":"IF($AG$474>0,SUM(IF($AG$116:$AG473=1,AK116:AK473,0))/$AG$474,0)","v":{"$error":"#DIV/0!"}},{"$f":"IF(COUNT(AL116:AL473)>0,SUM(AL116:AL473)/COUNT(AL116:AL473),0)","v":0.90140845070422537},{"$f":"IF(COUNT(AM116:AM473)>0,SUM(AM116:AM473)/COUNT(AM116:AM473),0)","v":44.839006259780902}]
[{"$f":"\"Live \" & AG474","v":"Live 71"},null,{"$f":"TEXT(SUM(IF(C$116:C$473= \"M\",1,0)*$AG$116:$AG$473)/$AG$474,\"##.##%\") &\" M\"","v":"47.89% M"},{"$f":"SUM(D$116:D$473*$AG$116:$AG$473)","v":"6611-12-07"},{"$f":"SUM(E$116:E$473*$AG$116:$AG$473)","v":"9465-09-14"},{"$f":"SUM(F$116:F$473*$AG$116:$AG$473)","v":5186550},{"$f":"SUM(G$116:G$473*$AG$116:$AG$473)","v":0},{"$f":"SUM(H$116:H$473*$AG$116:$AG$473)","v":497},{"$f":"SUM(I$116:I$473*$AG$116:$AG$473)","v":497},{"$f":"SUM(J$116:J$473*$AG$116:$AG$473)","v":17.75},{"$f":"SUM(K$116:K$473*$AG$116:$AG$473)","v":17.75},{"$f":"SUM(L$116:L$473*$AG$116:$AG$473)","v":6268555.9299999997},{"$f":"SUM(M$116:M$473*$AG$116:$AG$473)","v":62.913799999999995},{"$f":"SUM(N$116:N$473*$AG$116:$AG$473)","v":62.913799999999995},{"$f":"SUM(O$116:O$473*$AG$116:$AG$473)","v":2871592},{"$f":"SUM(P$116:P$473*$AG$116:$AG$473)","v":3048005},{"$f":"SUM(Q$116:Q$473*$AG$116:$AG$473)","v":4.7145622655190031},{"$f":"SUM(R$116:R$473*$AG$116:$AG$473)","v":{"$error":"#DIV/0!"}},{"$f":"SUM(S$116:S$473*$AG$116:$AG$473)","v":{"$error":"#DIV/0!"}},{"$f":"SUM(T$116:T$473*$AG$116:$AG$473)","v":4.8958392009360505},{"$f":"SUM(U$116:U$473*$AG$116:$AG$473)","v":0},{"$f":"SUM(V$116:V$473*$AG$116:$AG$473)","v":0},{"$f":"SUM(W$116:W$473*$AG$116:$AG$473)","v":0},{"$f":"SUM(X$116:X$473*$AG$116:$AG$473)","v":0},{"$f":"SUM(Y$116:Y$473*$AG$116:$AG$473)","v":0},{"$f":"SUM(Z$116:Z$473*$AG$116:$AG$473)","v":1982203},{"$f":"SUM(AA$116:AA$473*$AG$116:$AG$473)","v":70},{"$f":"SUM(AB$116:AB$473*$AG$116:$AG$473)","v":70},{"$f":"SUM(AC$116:AC$473*$AG$116:$AG$473)","v":1.7038116877674845},{"$f":"SUM(AD$116:AD$473*$AG$116:$AG$473)","v":1.4804620267916877},{"$f":"SUM(AE$116:AE$473*$AG$116:$AG$473)","v":1.7748441654302272},{"$f":"SUM(AF$116:AF$473*$AG$116:$AG$473)","v":6.6429999999999998},{"$f":"SUM(AG$116:AG$473*$AG$116:$AG$473)","v":71},{"$f":"SUM(IF($AG$116:$AG$473>0,AH$116:AH$473))","v":3595.2361111111099},{"$f":"SUM(IF($AG$116:$AG$473>0,AI$116:AI$473))","v":{"$error":"#DIV/0!"}},{"$f":"SUM(IF($AG$116:$AG$473>0,AJ$116:AJ$473))","v":741.57222222222219},{"$f":"SUM(IF($AG$116:$AG$473>0,AK$116:AK$473))","v":{"$error":"#DIV/0!"}},{"$f":"SUM(AL$116:AL$473*$AG$116:$AG$473)","v":64},{"$f":"SUM(AM$116:AM$473*$AG$116:$AG$473)","v":3183.5694444444439}]
["Live minimum",null,null,{"$f":"MIN(IF($AG$116:$AG473=1,D$116:D$473,9999999))","v":"00:00:00"},{"$f":"MIN(IF($AG$116:$AG473=1,E$116:E$473,9999999))","v":"00:00:00"},{"$f":"MIN(IF($AG$116:$AG473=1,F$116:F$473,9999999))","v":"2099-12-31"},{"$f":"MIN(IF($AG$116:$AG473=1,G$116:G$473,9999999))","v":0},{"$f":"MIN(IF($AG$116:$AG473=1,H$116:H$473,9999999))","v":7},{"$f":"MIN(IF($AG$116:$AG473=1,I$116:I$473,9999999))","v":7},{"$f":"MIN(IF($AG$116:$AG473=1,J$116:J$473,9999999))","v":0.25},{"$f":"MIN(IF($AG$116:$AG473=1,K$116:K$473,9999999))","v":0.25},{"$f":"MIN(IF($AG$116:$AG473=1,L$116:L$473,9999999))","v":0},{"$f":"MIN(IF($AG$116:$AG473=1,M$116:M$473,9999999))","v":0},{"$f":"MIN(IF($AG$116:$AG473=1,N$116:N$473,9999999))","v":0},{"$f":"MIN(IF($AG$116:$AG473=1,O$116:O$473,9999999))","v":0},{"$f":"MIN(IF($AG$116:$AG473=1,P$116:P$473,9999999))","v":"00:00:00"},{"$f":"MIN(IF($AG$116:$AG473=1,Q$116:Q$473,9999999))","v":0},{"$f":"MIN(IF($AG$116:$AG473=1,R$116:R$473,9999999))","v":{"$error":"#DIV/0!"}},{"$f":"MIN(IF($AG$116:$AG473=1,S$116:S$473,9999999))","v":{"$error":"#DIV/0!"}},{"$f":"MIN(IF($AG$116:$AG473=1,T$116:T$473,9999999))","v":0},{"$f":"MIN(IF($AG$116:$AG473=1,U$116:U$473,9999999))","v":0},{"$f":"MIN(IF($AG$116:$AG473=1,V$116:V$473,9999999))","v":0},{"$f":"MIN(IF($AG$116:$AG473=1,W$116:W$473,9999999))","v":0},{"$f":"MIN(IF($AG$116:$AG473=1,X$116:X$473,9999999))","v":0},{"$f":"MIN(IF($AG$116:$AG473=1,Y$116:Y$473,9999999))","v":0},{"$f":"MIN(IF($AG$116:$AG473=1,Z$116:Z$473,9999999))","v":0},{"$f":"MIN(IF($AG$116:$AG473=1,AA$116:AA$473,9999999))","v":0},{"$f":"MIN(IF($AG$116:$AG473=1,AB$116:AB$473,9999999))","v":0},{"$f":"MIN(IF($AG$116:$AG473=1,AC$116:AC$473,9999999))","v":0},{"$f":"MIN(IF($AG$116:$AG473=1,AD$116:AD$473,9999999))","v":0},{"$f":"MIN(IF($AG$116:$AG473=1,AE$116:AE$473,9999999))","v":0},{"$f":"MIN(IF($AG$116:$AG473=1,AF$116:AF$473,9999999))","v":0},{"$f":"MIN(IF($AG$116:$AG473=1,AG$116:AG$473,9999999))","v":1},{"$f":"MIN(IF($AG$116:$AG473=1,AH$116:AH$473,9999999))","v":29.333333333333332},{"$f":"MIN(IF($AG$116:$AG473=1,AI$116:AI$473,9999999))","v":{"$error":"#DIV/0!"}},{"$f":"MIN(IF($AG$116:$AG473=1,AJ$116:AJ$473,9999999))","v":0.28333333333333333},{"$f":"MIN(IF($AG$116:$AG473=1,AK$116:AK$473,9999999))","v":{"$error":"#DIV/0!"}},{"$f":"MIN(IF($AG$116:$AG473=1,AL$116:AL$473,9999999))","v":0},{"$f":"MIN(IF($AG$116:$AG473=1,AM$116:AM$473,9999999))","v":0}]
["Live maximum",null,null,{"$f":"MAX(IF($AG$116:$AG473=1,D$116:D$473,0))","v":"1987-08-30"},{"$f":"MAX(IF($AG$116:$AG473=1,E$116:E$473,0))","v":"2016-09-19"},{"$f":"MAX(IF($AG$116:$AG473=1,F$116:F$473,0))","v":"2099-12-31"},{"$f":"MAX(IF($AG$116:$AG473=1,G$116:G$473,0))","v":0},{"$f":"MAX(IF($AG$116:$AG473=1,H$116:H$473,0))","v":7},{"$f":"MAX(IF($AG$116:$AG473=1,I$116:I$473,0))","v":7},{"$f":"MAX(IF($AG$116:$AG473=1,J$116:J$473,0))","v":0.25},{"$f":"MAX(IF($AG$116:$AG473=1,K$116:K$473,0))","v":0.25},{"$f":"MAX(IF($AG$116:$AG473=1,L$116:L$473,0))","v":142609},{"$f":"MAX(IF($AG$116:$AG473=1,M$116:M$473,0))","v":1},{"$f":"MAX(IF($AG$116:$AG473=1,N$116:N$473,0))","v":1},{"$f":"MAX(IF($AG$116:$AG473=1,O$116:O$473,0))","v":42779},{"$f":"MAX(IF($AG$116:$AG473=1,P$116:P$473,0))","v":"2024-02-13"},{"$f":"MAX(IF($AG$116:$AG473=1,Q$116:Q$473,0))","v":0.24764399399535714},{"$f":"MAX(IF($AG$116:$AG473=1,R$116:R$473,0))","v":{"$error":"#DIV/0!"}},{"$f":"MAX(IF($AG$116:$AG473=1,S$116:S$473,0))","v":{"$error":"#DIV/0!"}},{"$f":"MAX(IF($AG$116:$AG473=1,T$116:T$473,0))","v":4.8958392009360505},{"$f":"MAX(IF($AG$116:$AG473=1,U$116:U$473,0))","v":0},{"$f":"MAX(IF($AG$116:$AG473=1,V$116:V$473,0))","v":0},{"$f":"MAX(IF($AG$116:$AG473=1,W$116:W$473,0))","v":0},{"$f":"MAX(IF($AG$116:$AG473=1,X$116:X$473,0))","v":0},{"$f":"MAX(IF($AG$116:$AG473=1,Y$116:Y$473,0))","v":0},{"$f":"MAX(IF($AG$116:$AG473=1,Z$116:Z$473,0))","v":54486},{"$f":"MAX(IF($AG$116:$AG473=1,AA$116:AA$473,0))","v":1},{"$f":"MAX(IF($AG$116:$AG473=1,AB$116:AB$473,0))","v":1},{"$f":"MAX(IF($AG$116:$AG473=1,AC$116:AC$473,0))","v":0.2543478260869565},{"$f":"MAX(IF($AG$116:$AG473=1,AD$116:AD$473,0))","v":0.25},{"$f":"MAX(IF($AG$116:$AG473=1,AE$116:AE$473,0))","v":0.2543478260869565},{"$f":"MAX(IF($AG$116:$AG473=1,AF$116:AF$473,0))","v":9.4899999999999998E-2},{"$f":"MAX(IF($AG$116:$AG473=1,AG$116:AG$473,0))","v":1},{"$f":"MAX(IF($AG$116:$AG473=1,AH$116:AH$473,0))","v":117.00277777777778},{"$f":"MAX(IF($AG$116:$AG473=1,AI$116:AI$473,0))","v":{"$error":"#DIV/0!"}},{"$f":"MAX(IF($AG$116:$AG473=1,AJ$116:AJ$473,0))","v":117.00277777777778},{"$f":"MAX(IF($AG$116:$AG473=1,AK$116:AK$473,0))","v":{"$error":"#DIV/0!"}},{"$f":"MAX(IF($AG$116:$AG473=1,AL$116:AL$473,0))","v":1},{"$f":"MAX(IF($AG$116:$AG473=1,AM$116:AM$473,0))","v":116.00277777777778}]
["Live average",null,null,{"$f":"SUM(D$116:D$473*$AG$116:$AG$473)/$AG$474","v":"1966-05-12T10:08:27.042"},{"$f":"SUM(E$116:E$473*$AG$116:$AG$473)/$AG$474","v":"2006-07-21T23:19:26.197"},{"$f":"SUM(F$116:F$473*$AG$116:$AG$473)/$AG$474","v":"2099-12-31"},{"$f":"SUM(G$116:G$473*$AG$116:$AG$473)/$AG$474","v":0},{"$f":"SUM(H$116:H$473*$AG$116:$AG$473)/$AG$474","v":7},{"$f":"SUM(I$116:I$473*$AG$116:$AG$473)/$AG$474","v":7},{"$f":"SUM(J$116:J$473*$AG$116:$AG$473)/$AG$474","v":0.25},{"$f":"SUM(K$116:K$473*$AG$116:$AG$473)/$AG$474","v":0.25},{"$f":"SUM(L$116:L$473*$AG$116:$AG$473)/$AG$474","v":88289.520140845067},{"$f":"SUM(M$116:M$473*$AG$116:$AG$473)/$AG$474","v":0.88610985915492946},{"$f":"SUM(N$116:N$473*$AG$116:$AG$473)/$AG$474","v":0.88610985915492946},{"$f":"SUM(O$116:O$473*$AG$116:$AG$473)/$AG$474","v":40444.957746478874},{"$f":"SUM(P$116:P$473*$AG$116:$AG$473)/$AG$474","v":"2017-07-13T15:32:57.465"},{"$f":"SUM(Q$116:Q$473*$AG$116:$AG$473)/$AG$474","v":6.6402285429845109E-2},{"$f":"SUM(R$116:R$473*$AG$116:$AG$473)/$AG$474","v":{"$error":"#DIV/0!"}},{"$f":"SUM(S$116:S$473*$AG$116:$AG$473)/$AG$474","v":{"$error":"#DIV/0!"}},{"$f":"SUM(T$116:T$473*$AG$116:$AG$473)/$AG$474","v":6.8955481703324661E-2},{"$f":"SUM(U$116:U$473*$AG$116:$AG$473)/$AG$474","v":0},{"$f":"SUM(V$116:V$473*$AG$116:$AG$473)/$AG$474","v":0},{"$f":"SUM(W$116:W$473*$AG$116:$AG$473)/$AG$474","v":0},{"$f":"SUM(X$116:X$473*$AG$116:$AG$473)/$AG$474","v":0},{"$f":"SUM(Y$116:Y$473*$AG$116:$AG$473)/$AG$474","v":0},{"$f":"SUM(Z$116:Z$473*$AG$116:$AG$473)/$AG$474","v":27918.352112676057},{"$f":"SUM(AA$116:AA$473*$AG$116:$AG$473)/$AG$474","v":0.9859154929577465},{"$f":"SUM(AB$116:AB$473*$AG$116:$AG$473)/$AG$474","v":0.9859154929577465},{"$f":"SUM(AC$116:AC$473*$AG$116:$AG$473)/$AG$474","v":2.3997347715034992E-2},{"$f":"SUM(AD$116:AD$473*$AG$116:$AG$473)/$AG$474","v":2.0851577842136447E-2},{"$f":"SUM(AE$116:AE$473*$AG$116:$AG$473)/$AG$474","v":2.4997805146904608E-2},{"$f":"SUM(AF$116:AF$473*$AG$116:$AG$473)/$AG$474","v":9.3563380281690131E-2},{"$f":"SUM(AG$116:AG$473*$AG$116:$AG$473)/$AG$474","v":1},{"$f":"AH478/$AG$478","v":50.637128325508591},{"$f":"AI478/$AG$478","v":{"$error":"#DIV/0!"}},{"$f":"AJ478/$AG$478","v":10.444679186228482},{"$f":"AK478/$AG$478","v":{"$error":"#DIV/0!"}},{"$f":"SUM(AL$116:AL$473*$AG$116:$AG$473)/$AG$474","v":0.90140845070422537},{"$f":"SUM(AM$116:AM$473*$AG$116:$AG$473)/$AG$474","v":44.839006259780902}]
["Minimum row","These are first rows in which the minimum and maximum occurs.",null,{"$f":"MIN(IF($AG$116:$AG$473 =1,1,999999999) * IF(D$116:D$473=D479,ROW(D$116:D$473),99999))","v":472},{"$f":"MIN(IF($AG$116:$AG$473 =1,1,999999999) * IF(E$116:E$473=E479,ROW(E$116:E$473),99999))","v":472},{"$f":"MIN(IF($AG$116:$AG$473 =1,1,999999999) * IF(F$116:F$473=F479,ROW(F$116:F$473),99999))","v":116},{"$f":"MIN(IF($AG$116:$AG$473 =1,1,999999999) * IF(G$116:G$473=G479,ROW(G$116:G$473),99999))","v":116},{"$f":"MIN(IF($AG$116:$AG$473 =1,1,999999999) * IF(H$116:H$473=H479,ROW(H$116:H$473),99999))","v":116},{"$f":"MIN(IF($AG$116:$AG$473 =1,1,999999999) * IF(I$116:I$473=I479,ROW(I$116:I$473),99999))","v":116},{"$f":"MIN(IF($AG$116:$AG$473 =1,1,999999999) * IF(J$116:J$473=J479,ROW(J$116:J$473),99999))","v":116},{"$f":"MIN(IF($AG$116:$AG$473 =1,1,999999999) * IF(K$116:K$473=K479,ROW(K$116:K$473),99999))","v":116},{"$f":"MIN(IF($AG$116:$AG$473 =1,1,999999999) * IF(L$116:L$473=L479,ROW(L$116:L$473),99999))","v":472},{"$f":"MIN(IF($AG$116:$AG$473 =1,1,999999999) * IF(M$116:M$473=M479,ROW(M$116:M$473),99999))","v":472},{"$f":"MIN(IF($AG$116:$AG$473 =1,1,999999999) * IF(N$116:N$473=N479,ROW(N$116:N$473),99999))","v":472},{"$f":"MIN(IF($AG$116:$AG$473 =1,1,999999999) * IF(O$116:O$473=O479,ROW(O$116:O$473),99999))","v":472},{"$f":"MIN(IF($AG$116:$AG$473 =1,1,999999999) * IF(P$116:P$473=P479,ROW(P$116:P$473),99999))","v":472},{"$f":"MIN(IF($AG$116:$AG$473 =1,1,999999999) * IF(Q$116:Q$473=Q479,ROW(Q$116:Q$473),99999))","v":116},{"$f":"MIN(IF($AG$116:$AG$473 =1,1,999999999) * IF(R$116:R$473=R479,ROW(R$116:R$473),99999))","v":{"$error":"#DIV/0!"}},{"$f":"MIN(IF($AG$116:$AG$473 =1,1,999999999) * IF(S$116:S$473=S479,ROW(S$116:S$473),99999))","v":{"$error":"#DIV/0!"}},{"$f":"MIN(IF($AG$116:$AG$473 =1,1,999999999) * IF(T$116:T$473=T479,ROW(T$116:T$473),99999))","v":117},{"$f":"MIN(IF($AG$116:$AG$473 =1,1,999999999) * IF(U$116:U$473=U479,ROW(U$116:U$473),99999))","v":116},{"$f":"MIN(IF($AG$116:$AG$473 =1,1,999999999) * IF(V$116:V$473=V479,ROW(V$116:V$473),99999))","v":116},{"$f":"MIN(IF($AG$116:$AG$473 =1,1,999999999) * IF(W$116:W$473=W479,ROW(W$116:W$473),99999))","v":116},{"$f":"MIN(IF($AG$116:$AG$473 =1,1,999999999) * IF(X$116:X$473=X479,ROW(X$116:X$473),99999))","v":116},{"$f":"MIN(IF($AG$116:$AG$473 =1,1,999999999) * IF(Y$116:Y$473=Y479,ROW(Y$116:Y$473),99999))","v":116},{"$f":"MIN(IF($AG$116:$AG$473 =1,1,999999999) * IF(Z$116:Z$473=Z479,ROW(Z$116:Z$473),99999))","v":473},{"$f":"MIN(IF($AG$116:$AG$473 =1,1,999999999) * IF(AA$116:AA$473=AA479,ROW(AA$116:AA$473),99999))","v":473},{"$f":"MIN(IF($AG$116:$AG$473 =1,1,999999999) * IF(AB$116:AB$473=AB479,ROW(AB$116:AB$473),99999))","v":473},{"$f":"MIN(IF($AG$116:$AG$473 =1,1,999999999) * IF(AC$116:AC$473=AC479,ROW(AC$116:AC$473),99999))","v":116},{"$f":"MIN(IF($AG$116:$AG$473 =1,1,999999999) * IF(AD$116:AD$473=AD479,ROW(AD$116:AD$473),99999))","v":117},{"$f":"MIN(IF($AG$116:$AG$473 =1,1,999999999) * IF(AE$116:AE$473=AE479,ROW(AE$116:AE$473),99999))","v":116},{"$f":"MIN(IF($AG$116:$AG$473 =1,1,999999999) * IF(AF$116:AF$473=AF479,ROW(AF$116:AF$473),99999))","v":473},{"$f":"AH474/AG474","v":50.637128325508591},{"$f":"MIN(IF(AH$116:AH$473=AH479,ROW(AH$116:AH$473),99999))","v":132},{"$f":"MIN(IF(AI$116:AI$473=AI479,ROW(AI$116:AI$473),99999))","v":{"$error":"#DIV/0!"}},null,null,{"$f":"AM474/AL474","v":49.743272569444436},{"$f":"MIN(IF(AM$116:AM$473=AM479,ROW(AM$116:AM$473),99999))","v":123}]
["Maximum row",null,null,{"$f":"MIN(IF($AG$116:$AG$473 =1,1,999999999) * IF(D$116:D$473=D480,ROW(D$116:D$473),99999))","v":132},{"$f":"MIN(IF($AG$116:$AG$473 =1,1,999999999) * IF(E$116:E$473=E480,ROW(E$116:E$473),99999))","v":123},{"$f":"MIN(IF($AG$116:$AG$473 =1,1,999999999) * IF(F$116:F$473=F480,ROW(F$116:F$473),99999))","v":116},{"$f":"MIN(IF($AG$116:$AG$473 =1,1,999999999) * IF(G$116:G$473=G480,ROW(G$116:G$473),99999))","v":116},{"$f":"MIN(IF($AG$116:$AG$473 =1,1,999999999) * IF(H$116:H$473=H480,ROW(H$116:H$473),99999))","v":116},{"$f":"MIN(IF($AG$116:$AG$473 =1,1,999999999) * IF(I$116:I$473=I480,ROW(I$116:I$473),99999))","v":116},{"$f":"MIN(IF($AG$116:$AG$473 =1,1,999999999) * IF(J$116:J$473=J480,ROW(J$116:J$473),99999))","v":116},{"$f":"MIN(IF($AG$116:$AG$473 =1,1,999999999) * IF(K$116:K$473=K480,ROW(K$116:K$473),99999))","v":116},{"$f":"MIN(IF($AG$116:$AG$473 =1,1,999999999) * IF(L$116:L$473=L480,ROW(L$116:L$473),99999))","v":182},{"$f":"MIN(IF($AG$116:$AG$473 =1,1,999999999) * IF(M$116:M$473=M480,ROW(M$116:M$473),99999))","v":117},{"$f":"MIN(IF($AG$116:$AG$473 =1,1,999999999) * IF(N$116:N$473=N480,ROW(N$116:N$473),99999))","v":117},{"$f":"MIN(IF($AG$116:$AG$473 =1,1,999999999) * IF(O$116:O$473=O480,ROW(O$116:O$473),99999))","v":132},{"$f":"MIN(IF($AG$116:$AG$473 =1,1,999999999) * IF(P$116:P$473=P480,ROW(P$116:P$473),99999))","v":132},{"$f":"MIN(IF($AG$116:$AG$473 =1,1,999999999) * IF(Q$116:Q$473=Q480,ROW(Q$116:Q$473),99999))","v":173},{"$f":"MIN(IF($AG$116:$AG$473 =1,1,999999999) * IF(R$116:R$473=R480,ROW(R$116:R$473),99999))","v":{"$error":"#DIV/0!"}},{"$f":"MIN(IF($AG$116:$AG$473 =1,1,999999999) * IF(S$116:S$473=S480,ROW(S$116:S$473),99999))","v":{"$error":"#DIV/0!"}},{"$f":"MIN(IF($AG$116:$AG$473 =1,1,999999999) * IF(T$116:T$473=T480,ROW(T$116:T$473),99999))","v":116},{"$f":"MIN(IF($AG$116:$AG$473 =1,1,999999999) * IF(U$116:U$473=U480,ROW(U$116:U$473),99999))","v":116},{"$f":"MIN(IF($AG$116:$AG$473 =1,1,999999999) * IF(V$116:V$473=V480,ROW(V$116:V$473),99999))","v":116},{"$f":"MIN(IF($AG$116:$AG$473 =1,1,999999999) * IF(W$116:W$473=W480,ROW(W$116:W$473),99999))","v":116},{"$f":"MIN(IF($AG$116:$AG$473 =1,1,999999999) * IF(X$116:X$473=X480,ROW(X$116:X$473),99999))","v":116},{"$f":"MIN(IF($AG$116:$AG$473 =1,1,999999999) * IF(Y$116:Y$473=Y480,ROW(Y$116:Y$473),99999))","v":116},{"$f":"MIN(IF($AG$116:$AG$473 =1,1,999999999) * IF(Z$116:Z$473=Z480,ROW(Z$116:Z$473),99999))","v":116},{"$f":"MIN(IF($AG$116:$AG$473 =1,1,999999999) * IF(AA$116:AA$473=AA480,ROW(AA$116:AA$473),99999))","v":116},{"$f":"MIN(IF($AG$116:$AG$473 =1,1,999999999) * IF(AB$116:AB$473=AB480,ROW(AB$116:AB$473),99999))","v":116},{"$f":"MIN(IF($AG$116:$AG$473 =1,1,999999999) * IF(AC$116:AC$473=AC480,ROW(AC$116:AC$473),99999))","v":151},{"$f":"MIN(IF($AG$116:$AG$473 =1,1,999999999) * IF(AD$116:AD$473=AD480,ROW(AD$116:AD$473),99999))","v":143},{"$f":"MIN(IF($AG$116:$AG$473 =1,1,999999999) * IF(AE$116:AE$473=AE480,ROW(AE$116:AE$473),99999))","v":151},{"$f":"MIN(IF($AG$116:$AG$473 =1,1,999999999) * IF(AF$116:AF$473=AF480,ROW(AF$116:AF$473),99999))","v":116},{"$f":"SUM(IF(UPPER(C116:C473)=\"M\",AG116:AG473,0))/AG474","v":0.47887323943661969},{"$f":"MAX(IF(AH$116:AH$473=AH480,ROW(AH$116:AH$473),0))","v":473},{"$f":"MAX(IF(AI$116:AI$473=AI480,ROW(AI$116:AI$473),0))","v":{"$error":"#DIV/0!"}},null,null,{"$f":"SUM(IF(UPPER(C116:C473)=\"M\",AL116:AL473,0))/AL474","v":0.484375},{"$f":"MAX(IF(AM$116:AM$473=AM480,ROW(AM$116:AM$473),0))","v":473}]
[]
[]
["Live record distributions"]
[]
[{"$f":"\"Age \" & TEXT(AH475,\"##\") & \" to \" &TEXT( AH476,\"##\")","v":"Age 29 to 117"},null,"Average service","Average accrued (RHS)",{"$f":"\"Service \" & TEXT(AJ475,\"#0\") & \" to \" &TEXT( AJ476,\"##\")","v":"Service 0 to 117"},"Proportion *100","Average accrued",{"$f":"\"Acccrued \" & TEXT(AK475,\"#0.00\") & \" to \" &TEXT( AK476,\"##0.00\")","v":{"$error":"#DIV/0!"}},null,"Position in range","Age cumulative","Service","Accrued","Service cummulative","Accrued"]
[{"$f":"AH475","v":29.333333333333332},{"$f":"FREQUENCY(IF($AG$116:$AG$473>0,AH$116:AH$473,\"\"),A$489:A$509)/$AG$474","v":1.4084507042253521E-2},{"$f":"L489/$K489","v":11.180555555555555},{"$f":"M489/$K489","v":-4.0255591578996518E-2},{"$f":"AJ475","v":0.28333333333333333},{"$f":"FREQUENCY(IF($AG$116:$AG$473>0,AJ$116:AJ$473,\"\"),E$489:E$509)/$AG$474*100","v":1.4084507042253522},{"$f":"O489/$N489","v":8.9000456004286951E-3},{"$f":"AK475","v":{"$error":"#DIV/0!"}},{"$f":"FREQUENCY(AK$116:AK$473,H$489:H$509)/$AG$474","v":{"$error":"#DIV/0!"}},0,{"$f":"SUM(IF($AH$116:$AH$473<=$A489,AG$116:AG$473,\"\"))","v":1},{"$f":"SUM(IF($AH$116:$AH$473<=$A489,AJ$116:AJ$473,0))","v":11.180555555555555},{"$f":"SUM(IF($AH$116:$AH$473<=$A489,AK$116:AK$473,0))","v":-4.0255591578996518E-2},{"$f":"SUM(IF($AJ$116:$AJ$473<=$E489,AG$116:AG$473,\"\"))","v":1},{"$f":"SUM(IF($AJ$116:$AJ$473<=$E489,AK$116:AK$473,\"\"))","v":8.9000456004286951E-3}]
[{"$f":"A489+(AH$476-AH$475)/20","v":33.716805555555553},8.4507042253521125E-2,{"$f":"IF($K490-$K489<>0,(L490-L489)/($K490-$K489),\"\")","v":3.8365740740740741},{"$f":"IF($K490-$K489<>0,(M490-M489)/($K490-$K489),\"\")","v":0.1265759935178388},{"$f":"E489+(AJ$476-AJ$475)/20","v":6.119305555555556},56.338028169014088,{"$f":"IF($N490-$N489<>0,(O490-O489)/($N490-$N489),\"\")","v":0.11148569069540915},{"$f":"H489+(AK$476-AK$475)/20","v":{"$error":"#DIV/0!"}},{"$error":"#DIV/0!"},0.05,{"$f":"SUM(IF($AH$116:$AH$473<=$A490,AG$116:AG$473,\"\"))","v":7},{"$f":"SUM(IF($AH$116:$AH$473<=$A490,AJ$116:AJ$473,0))","v":34.200000000000003},{"$f":"SUM(IF($AH$116:$AH$473<=$A490,AK$116:AK$473,0))","v":0.71920036952803623},{"$f":"SUM(IF($AJ$116:$AJ$473<=$E490,AG$116:AG$473,\"\"))","v":41},{"$f":"SUM(IF($AJ$116:$AJ$473<=$E490,AK$116:AK$473,\"\"))","v":4.4683276734167947}]
[{"$f":"2*A490-A489","v":38.100277777777777},8.4507042253521125E-2,{"$f":"IF($K491-$K490<>0,(L491-L490)/($K491-$K490),\"\")","v":4.9939814814814794},0.1353263359749127,{"$f":"2*E490-E489","v":11.955277777777779},23.943661971830984,{"$f":"IF($N491-$N490<>0,(O491-O490)/($N491-$N490),\"\")","v":0.12149434789536956},{"$f":"2*H490-H489","v":{"$error":"#DIV/0!"}},{"$error":"#DIV/0!"},{"$f":"2*J490-J489","v":0.1},{"$f":"SUM(IF($AH$116:$AH$473<=$A491,AG$116:AG$473,\"\"))","v":13},{"$f":"SUM(IF($AH$116:$AH$473<=$A491,AJ$116:AJ$473,0))","v":64.163888888888877},{"$f":"SUM(IF($AH$116:$AH$473<=$A491,AK$116:AK$473,0))","v":1.5311583853775124},{"$f":"SUM(IF($AJ$116:$AJ$473<=$E491,AG$116:AG$473,\"\"))","v":58},{"$f":"SUM(IF($AJ$116:$AJ$473<=$E491,AK$116:AK$473,\"\"))","v":6.5337315876380773}]
[{"$f":"2*A491-A490","v":42.483750000000001},0.12676056338028169,6.5052469135802466,7.6045944879851557E-2,{"$f":"2*E491-E490","v":17.791250000000002},5.6338028169014089,6.9968050995546927E-2,{"$f":"2*H491-H490","v":{"$error":"#DIV/0!"}},{"$error":"#DIV/0!"},{"$f":"2*J491-J490","v":0.15000000000000002},{"$f":"SUM(IF($AH$116:$AH$473<=$A492,AG$116:AG$473,\"\"))","v":22},{"$f":"SUM(IF($AH$116:$AH$473<=$A492,AJ$116:AJ$473,0))","v":122.71111111111109},{"$f":"SUM(IF($AH$116:$AH$473<=$A492,AK$116:AK$473,0))","v":2.2155718892961764},{"$f":"SUM(IF($AJ$116:$AJ$473<=$E492,AG$116:AG$473,\"\"))","v":62},{"$f":"SUM(IF($AJ$116:$AJ$473<=$E492,AK$116:AK$473,\"\"))","v":6.813603791620265}]
[46.867222222222225,0.12676056338028169,9.1240740740740769,9.607891938056036E-2,23.627222222222223,8.4507042253521121,4.9202492379329499E-2,{"$error":"#DIV/0!"},{"$error":"#DIV/0!"},0.20000000000000004,{"$f":"SUM(IF($AH$116:$AH$473<=$A493,AG$116:AG$473,\"\"))","v":31},{"$f":"SUM(IF($AH$116:$AH$473<=$A493,AJ$116:AJ$473,0))","v":204.82777777777778},{"$f":"SUM(IF($AH$116:$AH$473<=$A493,AK$116:AK$473,0))","v":3.0802821637212197},{"$f":"SUM(IF($AJ$116:$AJ$473<=$E493,AG$116:AG$473,\"\"))","v":68},{"$f":"SUM(IF($AJ$116:$AJ$473<=$E493,AK$116:AK$473,\"\"))","v":7.108818745896242}]
[51.250694444444449,8.4507042253521125E-2,3.0643518518518582,6.1311424480877307E-2,29.463194444444444,1.4084507042253522,1.9205942746035376E-2,{"$error":"#DIV/0!"},{"$error":"#DIV/0!"},0.25000000000000006,{"$f":"SUM(IF($AH$116:$AH$473<=$A494,AG$116:AG$473,\"\"))","v":37},{"$f":"SUM(IF($AH$116:$AH$473<=$A494,AJ$116:AJ$473,0))","v":223.21388888888893},{"$f":"SUM(IF($AH$116:$AH$473<=$A494,AK$116:AK$473,0))","v":3.4481507106064835},{"$f":"SUM(IF($AJ$116:$AJ$473<=$E494,AG$116:AG$473,\"\"))","v":69},{"$f":"SUM(IF($AJ$116:$AJ$473<=$E494,AK$116:AK$473,\"\"))","v":7.1280246886422773}]
[55.634166666666673,0.14084507042253522,8.9644444444444424,9.3118063962571412E-2,35.299166666666665,0,"",{"$error":"#DIV/0!"},{"$error":"#DIV/0!"},0.30000000000000004,{"$f":"SUM(IF($AH$116:$AH$473<=$A495,AG$116:AG$473,\"\"))","v":47},{"$f":"SUM(IF($AH$116:$AH$473<=$A495,AJ$116:AJ$473,0))","v":312.85833333333335},{"$f":"SUM(IF($AH$116:$AH$473<=$A495,AK$116:AK$473,0))","v":4.3793313502321976},{"$f":"SUM(IF($AJ$116:$AJ$473<=$E495,AG$116:AG$473,\"\"))","v":69},{"$f":"SUM(IF($AJ$116:$AJ$473<=$E495,AK$116:AK$473,\"\"))","v":7.1280246886422773}]
[60.017638888888897,0.18309859154929578,8.4094017094017115,0.13212046191535476,41.135138888888889,0,"",{"$error":"#DIV/0!"},{"$error":"#DIV/0!"},0.35000000000000003,{"$f":"SUM(IF($AH$116:$AH$473<=$A496,AG$116:AG$473,\"\"))","v":60},{"$f":"SUM(IF($AH$116:$AH$473<=$A496,AJ$116:AJ$473,0))","v":422.1805555555556},{"$f":"SUM(IF($AH$116:$AH$473<=$A496,AK$116:AK$473,0))","v":6.0968973551318095},{"$f":"SUM(IF($AJ$116:$AJ$473<=$E496,AG$116:AG$473,\"\"))","v":69},{"$f":"SUM(IF($AJ$116:$AJ$473<=$E496,AK$116:AK$473,\"\"))","v":7.1280246886422773}]
[64.401111111111121,5.6338028169014086E-2,8.4298611111110944,3.6159287396856588E-2,46.971111111111114,0,"",{"$error":"#DIV/0!"},{"$error":"#DIV/0!"},0.4,{"$f":"SUM(IF($AH$116:$AH$473<=$A497,AG$116:AG$473,\"\"))","v":64},{"$f":"SUM(IF($AH$116:$AH$473<=$A497,AJ$116:AJ$473,0))","v":455.9},{"$f":"SUM(IF($AH$116:$AH$473<=$A497,AK$116:AK$473,0))","v":6.2415345047192359},{"$f":"SUM(IF($AJ$116:$AJ$473<=$E497,AG$116:AG$473,\"\"))","v":69},{"$f":"SUM(IF($AJ$116:$AJ$473<=$E497,AK$116:AK$473,\"\"))","v":7.1280246886422773}]
[68.784583333333345,4.2253521126760563E-2,10.783333333333323,0.18559257544235042,52.807083333333338,0,"",{"$error":"#DIV/0!"},{"$error":"#DIV/0!"},0.45,{"$f":"SUM(IF($AH$116:$AH$473<=$A498,AG$116:AG$473,\"\"))","v":67},{"$f":"SUM(IF($AH$116:$AH$473<=$A498,AJ$116:AJ$473,0))","v":488.24999999999994},{"$f":"SUM(IF($AH$116:$AH$473<=$A498,AK$116:AK$473,0))","v":6.7983122310462871},{"$f":"SUM(IF($AJ$116:$AJ$473<=$E498,AG$116:AG$473,\"\"))","v":69},{"$f":"SUM(IF($AJ$116:$AJ$473<=$E498,AK$116:AK$473,\"\"))","v":7.1280246886422773}]
[73.168055555555569,2.8169014084507043E-2,9.6583333333333599,0.16485622879799511,58.643055555555563,0,"",{"$error":"#DIV/0!"},{"$error":"#DIV/0!"},0.5,{"$f":"SUM(IF($AH$116:$AH$473<=$A499,AG$116:AG$473,\"\"))","v":69},{"$f":"SUM(IF($AH$116:$AH$473<=$A499,AJ$116:AJ$473,0))","v":507.56666666666666},{"$f":"SUM(IF($AH$116:$AH$473<=$A499,AK$116:AK$473,0))","v":7.1280246886422773},{"$f":"SUM(IF($AJ$116:$AJ$473<=$E499,AG$116:AG$473,\"\"))","v":69},{"$f":"SUM(IF($AJ$116:$AJ$473<=$E499,AK$116:AK$473,\"\"))","v":7.1280246886422773}]
[77.551527777777792,0,"","",64.479027777777787,0,"",{"$error":"#DIV/0!"},{"$error":"#DIV/0!"},0.55000000000000004,{"$f":"SUM(IF($AH$116:$AH$473<=$A500,AG$116:AG$473,\"\"))","v":69},{"$f":"SUM(IF($AH$116:$AH$473<=$A500,AJ$116:AJ$473,0))","v":507.56666666666666},{"$f":"SUM(IF($AH$116:$AH$473<=$A500,AK$116:AK$473,0))","v":7.1280246886422773},{"$f":"SUM(IF($AJ$116:$AJ$473<=$E500,AG$116:AG$473,\"\"))","v":69},{"$f":"SUM(IF($AJ$116:$AJ$473<=$E500,AK$116:AK$473,\"\"))","v":7.1280246886422773}]
[81.935000000000016,0,"","",70.315000000000012,0,"",{"$error":"#DIV/0!"},{"$error":"#DIV/0!"},0.60000000000000009,{"$f":"SUM(IF($AH$116:$AH$473<=$A501,AG$116:AG$473,\"\"))","v":69},{"$f":"SUM(IF($AH$116:$AH$473<=$A501,AJ$116:AJ$473,0))","v":507.56666666666666},{"$f":"SUM(IF($AH$116:$AH$473<=$A501,AK$116:AK$473,0))","v":7.1280246886422773},{"$f":"SUM(IF($AJ$116:$AJ$473<=$E501,AG$116:AG$473,\"\"))","v":69},{"$f":"SUM(IF($AJ$116:$AJ$473<=$E501,AK$116:AK$473,\"\"))","v":7.1280246886422773}]
[86.31847222222224,0,"","",76.150972222222236,0,"",{"$error":"#DIV/0!"},{"$error":"#DIV/0!"},0.65000000000000013,{"$f":"SUM(IF($AH$116:$AH$473<=$A502,AG$116:AG$473,\"\"))","v":69},{"$f":"SUM(IF($AH$116:$AH$473<=$A502,AJ$116:AJ$473,0))","v":507.56666666666666},{"$f":"SUM(IF($AH$116:$AH$473<=$A502,AK$116:AK$473,0))","v":7.1280246886422773},{"$f":"SUM(IF($AJ$116:$AJ$473<=$E502,AG$116:AG$473,\"\"))","v":69},{"$f":"SUM(IF($AJ$116:$AJ$473<=$E502,AK$116:AK$473,\"\"))","v":7.1280246886422773}]
[90.701944444444464,0,"","",81.986944444444461,0,"",{"$error":"#DIV/0!"},{"$error":"#DIV/0!"},0.70000000000000018,{"$f":"SUM(IF($AH$116:$AH$473<=$A503,AG$116:AG$473,\"\"))","v":69},{"$f":"SUM(IF($AH$116:$AH$473<=$A503,AJ$116:AJ$473,0))","v":507.56666666666666},{"$f":"SUM(IF($AH$116:$AH$473<=$A503,AK$116:AK$473,0))","v":7.1280246886422773},{"$f":"SUM(IF($AJ$116:$AJ$473<=$E503,AG$116:AG$473,\"\"))","v":69},{"$f":"SUM(IF($AJ$116:$AJ$473<=$E503,AK$116:AK$473,\"\"))","v":7.1280246886422773}]
[95.085416666666688,0,"","",87.822916666666686,0,"",{"$error":"#DIV/0!"},{"$error":"#DIV/0!"},0.75000000000000022,{"$f":"SUM(IF($AH$116:$AH$473<=$A504,AG$116:AG$473,\"\"))","v":69},{"$f":"SUM(IF($AH$116:$AH$473<=$A504,AJ$116:AJ$473,0))","v":507.56666666666666},{"$f":"SUM(IF($AH$116:$AH$473<=$A504,AK$116:AK$473,0))","v":7.1280246886422773},{"$f":"SUM(IF($AJ$116:$AJ$473<=$E504,AG$116:AG$473,\"\"))","v":69},{"$f":"SUM(IF($AJ$116:$AJ$473<=$E504,AK$116:AK$473,\"\"))","v":7.1280246886422773}]
[99.468888888888912,0,"","",93.65888888888891,0,"",{"$error":"#DIV/0!"},{"$error":"#DIV/0!"},0.80000000000000027,{"$f":"SUM(IF($AH$116:$AH$473<=$A505,AG$116:AG$473,\"\"))","v":69},{"$f":"SUM(IF($AH$116:$AH$473<=$A505,AJ$116:AJ$473,0))","v":507.56666666666666},{"$f":"SUM(IF($AH$116:$AH$473<=$A505,AK$116:AK$473,0))","v":7.1280246886422773},{"$f":"SUM(IF($AJ$116:$AJ$473<=$E505,AG$116:AG$473,\"\"))","v":69},{"$f":"SUM(IF($AJ$116:$AJ$473<=$E505,AK$116:AK$473,\"\"))","v":7.1280246886422773}]
[103.85236111111114,0,"","",99.494861111111135,0,"",{"$error":"#DIV/0!"},{"$error":"#DIV/0!"},0.85000000000000031,{"$f":"SUM(IF($AH$116:$AH$473<=$A506,AG$116:AG$473,\"\"))","v":69},{"$f":"SUM(IF($AH$116:$AH$473<=$A506,AJ$116:AJ$473,0))","v":507.56666666666666},{"$f":"SUM(IF($AH$116:$AH$473<=$A506,AK$116:AK$473,0))","v":7.1280246886422773},{"$f":"SUM(IF($AJ$116:$AJ$473<=$E506,AG$116:AG$473,\"\"))","v":69},{"$f":"SUM(IF($AJ$116:$AJ$473<=$E506,AK$116:AK$473,\"\"))","v":7.1280246886422773}]
[108.23583333333336,0,"","",105.33083333333336,0,"",{"$error":"#DIV/0!"},{"$error":"#DIV/0!"},0.90000000000000036,{"$f":"SUM(IF($AH$116:$AH$473<=$A507,AG$116:AG$473,\"\"))","v":69},{"$f":"SUM(IF($AH$116:$AH$473<=$A507,AJ$116:AJ$473,0))","v":507.56666666666666},{"$f":"SUM(IF($AH$116:$AH$473<=$A507,AK$116:AK$473,0))","v":7.1280246886422773},{"$f":"SUM(IF($AJ$116:$AJ$473<=$E507,AG$116:AG$473,\"\"))","v":69},{"$f":"SUM(IF($AJ$116:$AJ$473<=$E507,AK$116:AK$473,\"\"))","v":7.1280246886422773}]
[112.61930555555558,0,"","",111.16680555555558,0,"",{"$error":"#DIV/0!"},{"$error":"#DIV/0!"},0.9500000000000004,{"$f":"SUM(IF($AH$116:$AH$473<=$A508,AG$116:AG$473,\"\"))","v":69},{"$f":"SUM(IF($AH$116:$AH$473<=$A508,AJ$116:AJ$473,0))","v":507.56666666666666},{"$f":"SUM(IF($AH$116:$AH$473<=$A508,AK$116:AK$473,0))","v":7.1280246886422773},{"$f":"SUM(IF($AJ$116:$AJ$473<=$E508,AG$116:AG$473,\"\"))","v":69},{"$f":"SUM(IF($AJ$116:$AJ$473<=$E508,AK$116:AK$473,\"\"))","v":7.1280246886422773}]
[117.00277777777781,2.8169014084507043E-2,117.00277777777777,{"$error":"#DIV/0!"},117.00277777777781,2.8169014084507045,{"$error":"#DIV/0!"},{"$error":"#DIV/0!"},{"$error":"#DIV/0!"},1.0000000000000004,{"$f":"SUM(IF($AH$116:$AH$473<=$A509,AG$116:AG$473,\"\"))","v":71},{"$f":"SUM(IF($AH$116:$AH$473<=$A509,AJ$116:AJ$473,0))","v":741.57222222222219},{"$f":"SUM(IF($AH$116:$AH$473<=$A509,AK$116:AK$473,0))","v":{"$error":"#DIV/0!"}},{"$f":"SUM(IF($AJ$116:$AJ$473<=$E509,AG$116:AG$473,\"\"))","v":71},{"$f":"SUM(IF($AJ$116:$AJ$473<=$E509,AK$116:AK$473,\"\"))","v":{"$error":"#DIV/0!"}}]
[]
[null,{"$f":"SUM(B489:B510)","v":1},null,null,null,{"$f":"SUM(F489:F510)","v":100.00000000000001}]
[]
["Service distribution of exits and in force"]
[]
["Years","Exits"]
[0,{"$f":"SUM(IF($F$116:$F$473-$E$116:$E$473>365.25*$A516,1,0)*IF($F$116:$F$473-$E$116:$E$473<=365.25*($A516+1),1,0)*IF($F$116:$F$473>EOMONTH(ValDate,-60),1,0))","v":0}]
[1,{"$f":"SUM(IF($F$116:$F$473-$E$116:$E$473>365.25*$A517,1,0)*IF($F$116:$F$473-$E$116:$E$473<=365.25*($A517+1),1,0)*IF($F$116:$F$473>EOMONTH(ValDate,-60),1,0))","v":0}]
[2,{"$f":"SUM(IF($F$116:$F$473-$E$116:$E$473>365.25*$A518,1,0)*IF($F$116:$F$473-$E$116:$E$473<=365.25*($A518+1),1,0)*IF($F$116:$F$473>EOMONTH(ValDate,-60),1,0))","v":0}]
[3,{"$f":"SUM(IF($F$116:$F$473-$E$116:$E$473>365.25*$A519,1,0)*IF($F$116:$F$473-$E$116:$E$473<=365.25*($A519+1),1,0)*IF($F$116:$F$473>EOMONTH(ValDate,-60),1,0))","v":0}]
[4,{"$f":"SUM(IF($F$116:$F$473-$E$116:$E$473>365.25*$A520,1,0)*IF($F$116:$F$473-$E$116:$E$473<=365.25*($A520+1),1,0)*IF($F$116:$F$473>EOMONTH(ValDate,-60),1,0))","v":0}]
[5,{"$f":"SUM(IF($F$116:$F$473-$E$116:$E$473>365.25*$A521,1,0)*IF($F$116:$F$473-$E$116:$E$473<=365.25*($A521+1),1,0)*IF($F$116:$F$473>EOMONTH(ValDate,-60),1,0))","v":0}]
[6,{"$f":"SUM(IF($F$116:$F$473-$E$116:$E$473>365.25*$A522,1,0)*IF($F$116:$F$473-$E$116:$E$473<=365.25*($A522+1),1,0)*IF($F$116:$F$473>EOMONTH(ValDate,-60),1,0))","v":0}]
[7,{"$f":"SUM(IF($F$116:$F$473-$E$116:$E$473>365.25*$A523,1,0)*IF($F$116:$F$473-$E$116:$E$473<=365.25*($A523+1),1,0)*IF($F$116:$F$473>EOMONTH(ValDate,-60),1,0))","v":0}]
[8,{"$f":"SUM(IF($F$116:$F$473-$E$116:$E$473>365.25*$A524,1,0)*IF($F$116:$F$473-$E$116:$E$473<=365.25*($A524+1),1,0)*IF($F$116:$F$473>EOMONTH(ValDate,-60),1,0))","v":0}]
[9,{"$f":"SUM(IF($F$116:$F$473-$E$116:$E$473>365.25*$A525,1,0)*IF($F$116:$F$473-$E$116:$E$473<=365.25*($A525+1),1,0)*IF($F$116:$F$473>EOMONTH(ValDate,-60),1,0))","v":0}]
[10,{"$f":"SUM(IF($F$116:$F$473-$E$116:$E$473>365.25*$A526,1,0)*IF($F$116:$F$473-$E$116:$E$473<=365.25*($A526+1),1,0)*IF($F$116:$F$473>EOMONTH(ValDate,-60),1,0))","v":0}]
[11,{"$f":"SUM(IF($F$116:$F$473-$E$116:$E$473>365.25*$A527,1,0)*IF($F$116:$F$473-$E$116:$E$473<=365.25*($A527+1),1,0)*IF($F$116:$F$473>EOMONTH(ValDate,-60),1,0))","v":0}]
[12,{"$f":"SUM(IF($F$116:$F$473-$E$116:$E$473>365.25*$A528,1,0)*IF($F$116:$F$473-$E$116:$E$473<=365.25*($A528+1),1,0)*IF($F$116:$F$473>EOMONTH(ValDate,-60),1,0))","v":0}]
[13,{"$f":"SUM(IF($F$116:$F$473-$E$116:$E$473>365.25*$A529,1,0)*IF($F$116:$F$473-$E$116:$E$473<=365.25*($A529+1),1,0)*IF($F$116:$F$473>EOMONTH(ValDate,-60),1,0))","v":0}]
[14,{"$f":"SUM(IF($F$116:$F$473-$E$116:$E$473>365.25*$A530,1,0)*IF($F$116:$F$473-$E$116:$E$473<=365.25*($A530+1),1,0)*IF($F$116:$F$473>EOMONTH(ValDate,-60),1,0))","v":0}]
[15,{"$f":"SUM(IF($F$116:$F$473-$E$116:$E$473>365.25*$A531,1,0)*IF($F$116:$F$473-$E$116:$E$473<=365.25*($A531+1),1,0)*IF($F$116:$F$473>EOMONTH(ValDate,-60),1,0))","v":0}]
[16,{"$f":"SUM(IF($F$116:$F$473-$E$116:$E$473>365.25*$A532,1,0)*IF($F$116:$F$473-$E$116:$E$473<=365.25*($A532+1),1,0)*IF($F$116:$F$473>EOMONTH(ValDate,-60),1,0))","v":0}]
[17,{"$f":"SUM(IF($F$116:$F$473-$E$116:$E$473>365.25*$A533,1,0)*IF($F$116:$F$473-$E$116:$E$473<=365.25*($A533+1),1,0)*IF($F$116:$F$473>EOMONTH(ValDate,-60),1,0))","v":0}]
[18,{"$f":"SUM(IF($F$116:$F$473-$E$116:$E$473>365.25*$A534,1,0)*IF($F$116:$F$473-$E$116:$E$473<=365.25*($A534+1),1,0)*IF($F$116:$F$473>EOMONTH(ValDate,-60),1,0))","v":0}]
[19,{"$f":"SUM(IF($F$116:$F$473-$E$116:$E$473>365.25*$A535,1,0)*IF($F$116:$F$473-$E$116:$E$473<=365.25*($A535+1),1,0)*IF($F$116:$F$473>EOMONTH(ValDate,-60),1,0))","v":0}]
["All",{"$f":"SUM(B516:B535)","v":0}]